php.net |  support |  documentation |  report a bug |  advanced search |  search howto |  statistics |  random bug |  login
Return to Bug #75205
Patch Bugsreport revision 2017-09-14 02:26 UTC by ecamy at 163 dot com

Patch Bugsreport for Testing related Bug #75205

Patch version 2017-09-14 02:26 UTC

Return to Bug #75205 | Download this patch
Patch Revisions:

Developer: ecamy@163.com


=====================================================================
EXPECTED FAILED TEST SUMMARY
---------------------------------------------------------------------
Test open_basedir configuration [tests/security/open_basedir_linkinfo.phpt]  XFAIL REASON: BUG: open_basedir cannot delete symlink to prohibited file. See also
bugs 48111 and 52176.
Inconsistencies when accessing protected members [Zend/tests/access_modifiers_008.phpt]  XFAIL REASON: Discussion: http://marc.info/?l=php-internals&m=120221184420957&w=2
Inconsistencies when accessing protected members - 2 [Zend/tests/access_modifiers_009.phpt]  XFAIL REASON: Discussion: http://marc.info/?l=php-internals&m=120221184420957&w=2
Bug #48770 (call_user_func_array() fails to call parent from inheriting class) [Zend/tests/bug48770.phpt]  XFAIL REASON: See Bug #48770
Bug #48770 (call_user_func_array() fails to call parent from inheriting class) [Zend/tests/bug48770_2.phpt]  XFAIL REASON: See Bug #48770
Bug #48770 (call_user_func_array() fails to call parent from inheriting class) [Zend/tests/bug48770_3.phpt]  XFAIL REASON: See Bug #48770
Bug #64896 (Segfault with gc_collect_cycles using unserialize on certain objects) [Zend/tests/bug64896.phpt]  XFAIL REASON: We can not fix this bug without a significant (performace slow down) change to gc
Initial value of static var in method depends on the include time of the class definition [Zend/tests/method_static_var.phpt]  XFAIL REASON: Maybe not a bug
DateTime::add() -- fall type2 type3 [ext/date/tests/DateTime_add-fall-type2-type3.phpt]  XFAIL REASON: Various bugs exist
DateTime::add() -- fall type3 type2 [ext/date/tests/DateTime_add-fall-type3-type2.phpt]  XFAIL REASON: Various bugs exist
DateTime::add() -- fall type3 type3 [ext/date/tests/DateTime_add-fall-type3-type3.phpt]  XFAIL REASON: Various bugs exist
DateTime::add() -- spring type2 type3 [ext/date/tests/DateTime_add-spring-type2-type3.phpt]  XFAIL REASON: Various bugs exist
DateTime::add() -- spring type3 type2 [ext/date/tests/DateTime_add-spring-type3-type2.phpt]  XFAIL REASON: Various bugs exist
DateTime::add() -- spring type3 type3 [ext/date/tests/DateTime_add-spring-type3-type3.phpt]  XFAIL REASON: Various bugs exist
DateTime::diff() -- fall type2 type3 [ext/date/tests/DateTime_diff-fall-type2-type3.phpt]  XFAIL REASON: Various bugs exist
DateTime::diff() -- fall type3 type2 [ext/date/tests/DateTime_diff-fall-type3-type2.phpt]  XFAIL REASON: Various bugs exist
DateTime::diff() -- fall type3 type3 [ext/date/tests/DateTime_diff-fall-type3-type3.phpt]  XFAIL REASON: Various bugs exist
DateTime::diff() -- spring type2 type3 [ext/date/tests/DateTime_diff-spring-type2-type3.phpt]  XFAIL REASON: Various bugs exist
DateTime::diff() -- spring type3 type2 [ext/date/tests/DateTime_diff-spring-type3-type2.phpt]  XFAIL REASON: Various bugs exist
DateTime::diff() -- spring type3 type3 [ext/date/tests/DateTime_diff-spring-type3-type3.phpt]  XFAIL REASON: Various bugs exist
DateTime::sub() -- fall type2 type3 [ext/date/tests/DateTime_sub-fall-type2-type3.phpt]  XFAIL REASON: Various bugs exist
DateTime::sub() -- fall type3 type2 [ext/date/tests/DateTime_sub-fall-type3-type2.phpt]  XFAIL REASON: Various bugs exist
DateTime::sub() -- fall type3 type3 [ext/date/tests/DateTime_sub-fall-type3-type3.phpt]  XFAIL REASON: Various bugs exist
DateTime::sub() -- spring type2 type3 [ext/date/tests/DateTime_sub-spring-type2-type3.phpt]  XFAIL REASON: Various bugs exist
DateTime::sub() -- spring type3 type2 [ext/date/tests/DateTime_sub-spring-type3-type2.phpt]  XFAIL REASON: Various bugs exist
DateTime::sub() -- spring type3 type3 [ext/date/tests/DateTime_sub-spring-type3-type3.phpt]  XFAIL REASON: Various bugs exist
RFC: DateTime and Daylight Saving Time Transitions (zone type 3, bd2) [ext/date/tests/rfc-datetime_and_daylight_saving_time-type3-bd2.phpt]  XFAIL REASON: Still not quite right
RFC: DateTime and Daylight Saving Time Transitions (zone type 3, fs) [ext/date/tests/rfc-datetime_and_daylight_saving_time-type3-fs.phpt]  XFAIL REASON: Still not quite right
Bug #42718 (unsafe_raw filter not applied when configured as default filter) [ext/filter/tests/bug42718.phpt]  XFAIL REASON: FILTER_UNSAFE_RAW not applied when configured as default filter, even with flags
Bug #67296 (filter_input doesn't validate variables) [ext/filter/tests/bug49184.phpt]  XFAIL REASON: See Bug #49184
Bug #67167: filter_var(null,FILTER_VALIDATE_BOOLEAN,FILTER_NULL_ON_FAILURE) returns null [ext/filter/tests/bug67167.02.phpt]  XFAIL REASON: Requires php_zval_filter to not use convert_to_string for all filters.
zend multibyte (7) [ext/mbstring/tests/zend_multibyte-07.phpt]  XFAIL REASON: https://bugs.php.net/bug.php?id=66582
zend multibyte (9) [ext/mbstring/tests/zend_multibyte-09.phpt]  XFAIL REASON: https://bugs.php.net/bug.php?id=66582
Bug #72663: Create an Unexpected Object and Don't Invoke __wakeup() in Deserialization [ext/standard/tests/strings/bug72663_3.phpt]  XFAIL REASON: Memory leak, TBF later.
Bug #70470 (Built-in server truncates headers spanning over TCP packets) [sapi/cli/tests/bug70470.phpt]  XFAIL REASON: bug is not fixed yet
=====================================================================

=====================================================================
FAILED TEST SUMMARY
---------------------------------------------------------------------
Bug #64267 (CURLOPT_INFILE doesn't allow reset) [ext/curl/tests/bug64267.phpt]
Bug #71523 (Copied handle with new option CURLOPT_HTTPHEADER crashes while curl_multi_exec) [ext/curl/tests/bug71523.phpt]
Bug #65538: SSL context "cafile" disallows URL stream wrappers [ext/openssl/tests/bug65538_002.phpt]
ext/sockets - socket_bind - basic test [ext/sockets/tests/socket_bind.phpt]
int socket_send ( resource $socket , string $buf , int $len , int $flags ); [ext/sockets/tests/socket_send.phpt]
bool socket_shutdown ( resource $socket [, int $how = 2 ] ) ; [ext/sockets/tests/socket_shutdown.phpt]
gethostbyname() function - basic return valid ip address test [ext/standard/tests/network/gethostbyname_error004.phpt]
getmxrr() test [ext/standard/tests/network/getmxrr.phpt]
=====================================================================

=====================================================================
WARNED TEST SUMMARY
---------------------------------------------------------------------
zend multibyte (2) [ext/mbstring/tests/zend_multibyte-02.phpt] (warn: XFAIL section but test passes)
zend multibyte (6) [ext/mbstring/tests/zend_multibyte-06.phpt] (warn: XFAIL section but test passes)
zend multibyte (8) [ext/mbstring/tests/zend_multibyte-08.phpt] (warn: XFAIL section but test passes)
zend multibyte (10) [ext/mbstring/tests/zend_multibyte-10.phpt] (warn: XFAIL section but test passes)
zend multibyte (11) [ext/mbstring/tests/zend_multibyte-11.phpt] (warn: XFAIL section but test passes)
Phar: bug #69958: Segfault in Phar::convertToData on invalid file [ext/phar/tests/bug69958.phpt] (warn: XFAIL section but test passes)
Bug #69111 Crash in SessionHandler::read() [ext/session/tests/bug69111.phpt] (warn: XFAIL section but test passes)
Bug #70172 - Use After Free Vulnerability in unserialize() [ext/standard/tests/serialize/bug70172.phpt] (warn: XFAIL section but test passes)
=====================================================================


=====================================================================
TEST RESULT SUMMARY
---------------------------------------------------------------------
Exts skipped    :   39
Exts tested     :   40
---------------------------------------------------------------------

Number of tests : 13992             10328
Tests skipped   : 3664 ( 26.2%) --------
Tests warned    :    8 (  0.1%) (  0.1%)
Tests failed    :    8 (  0.1%) (  0.1%)
Expected fail   :   35 (  0.3%) (  0.3%)
Tests passed    : 10277 ( 73.4%) ( 99.5%)
---------------------------------------------------------------------
Time taken      : 1402 seconds
=====================================================================

=====================================================================
EXPECTED FAILED TEST SUMMARY
---------------------------------------------------------------------
Test open_basedir configuration [tests/security/open_basedir_linkinfo.phpt]  XFAIL REASON: BUG: open_basedir cannot delete symlink to prohibited file. See also
bugs 48111 and 52176.
Inconsistencies when accessing protected members [Zend/tests/access_modifiers_008.phpt]  XFAIL REASON: Discussion: http://marc.info/?l=php-internals&m=120221184420957&w=2
Inconsistencies when accessing protected members - 2 [Zend/tests/access_modifiers_009.phpt]  XFAIL REASON: Discussion: http://marc.info/?l=php-internals&m=120221184420957&w=2
Bug #48770 (call_user_func_array() fails to call parent from inheriting class) [Zend/tests/bug48770.phpt]  XFAIL REASON: See Bug #48770
Bug #48770 (call_user_func_array() fails to call parent from inheriting class) [Zend/tests/bug48770_2.phpt]  XFAIL REASON: See Bug #48770
Bug #48770 (call_user_func_array() fails to call parent from inheriting class) [Zend/tests/bug48770_3.phpt]  XFAIL REASON: See Bug #48770
Bug #64896 (Segfault with gc_collect_cycles using unserialize on certain objects) [Zend/tests/bug64896.phpt]  XFAIL REASON: We can not fix this bug without a significant (performace slow down) change to gc
Initial value of static var in method depends on the include time of the class definition [Zend/tests/method_static_var.phpt]  XFAIL REASON: Maybe not a bug
DateTime::add() -- fall type2 type3 [ext/date/tests/DateTime_add-fall-type2-type3.phpt]  XFAIL REASON: Various bugs exist
DateTime::add() -- fall type3 type2 [ext/date/tests/DateTime_add-fall-type3-type2.phpt]  XFAIL REASON: Various bugs exist
DateTime::add() -- fall type3 type3 [ext/date/tests/DateTime_add-fall-type3-type3.phpt]  XFAIL REASON: Various bugs exist
DateTime::add() -- spring type2 type3 [ext/date/tests/DateTime_add-spring-type2-type3.phpt]  XFAIL REASON: Various bugs exist
DateTime::add() -- spring type3 type2 [ext/date/tests/DateTime_add-spring-type3-type2.phpt]  XFAIL REASON: Various bugs exist
DateTime::add() -- spring type3 type3 [ext/date/tests/DateTime_add-spring-type3-type3.phpt]  XFAIL REASON: Various bugs exist
DateTime::diff() -- fall type2 type3 [ext/date/tests/DateTime_diff-fall-type2-type3.phpt]  XFAIL REASON: Various bugs exist
DateTime::diff() -- fall type3 type2 [ext/date/tests/DateTime_diff-fall-type3-type2.phpt]  XFAIL REASON: Various bugs exist
DateTime::diff() -- fall type3 type3 [ext/date/tests/DateTime_diff-fall-type3-type3.phpt]  XFAIL REASON: Various bugs exist
DateTime::diff() -- spring type2 type3 [ext/date/tests/DateTime_diff-spring-type2-type3.phpt]  XFAIL REASON: Various bugs exist
DateTime::diff() -- spring type3 type2 [ext/date/tests/DateTime_diff-spring-type3-type2.phpt]  XFAIL REASON: Various bugs exist
DateTime::diff() -- spring type3 type3 [ext/date/tests/DateTime_diff-spring-type3-type3.phpt]  XFAIL REASON: Various bugs exist
DateTime::sub() -- fall type2 type3 [ext/date/tests/DateTime_sub-fall-type2-type3.phpt]  XFAIL REASON: Various bugs exist
DateTime::sub() -- fall type3 type2 [ext/date/tests/DateTime_sub-fall-type3-type2.phpt]  XFAIL REASON: Various bugs exist
DateTime::sub() -- fall type3 type3 [ext/date/tests/DateTime_sub-fall-type3-type3.phpt]  XFAIL REASON: Various bugs exist
DateTime::sub() -- spring type2 type3 [ext/date/tests/DateTime_sub-spring-type2-type3.phpt]  XFAIL REASON: Various bugs exist
DateTime::sub() -- spring type3 type2 [ext/date/tests/DateTime_sub-spring-type3-type2.phpt]  XFAIL REASON: Various bugs exist
DateTime::sub() -- spring type3 type3 [ext/date/tests/DateTime_sub-spring-type3-type3.phpt]  XFAIL REASON: Various bugs exist
RFC: DateTime and Daylight Saving Time Transitions (zone type 3, bd2) [ext/date/tests/rfc-datetime_and_daylight_saving_time-type3-bd2.phpt]  XFAIL REASON: Still not quite right
RFC: DateTime and Daylight Saving Time Transitions (zone type 3, fs) [ext/date/tests/rfc-datetime_and_daylight_saving_time-type3-fs.phpt]  XFAIL REASON: Still not quite right
Bug #42718 (unsafe_raw filter not applied when configured as default filter) [ext/filter/tests/bug42718.phpt]  XFAIL REASON: FILTER_UNSAFE_RAW not applied when configured as default filter, even with flags
Bug #67296 (filter_input doesn't validate variables) [ext/filter/tests/bug49184.phpt]  XFAIL REASON: See Bug #49184
Bug #67167: filter_var(null,FILTER_VALIDATE_BOOLEAN,FILTER_NULL_ON_FAILURE) returns null [ext/filter/tests/bug67167.02.phpt]  XFAIL REASON: Requires php_zval_filter to not use convert_to_string for all filters.
zend multibyte (7) [ext/mbstring/tests/zend_multibyte-07.phpt]  XFAIL REASON: https://bugs.php.net/bug.php?id=66582
zend multibyte (9) [ext/mbstring/tests/zend_multibyte-09.phpt]  XFAIL REASON: https://bugs.php.net/bug.php?id=66582
Bug #72663: Create an Unexpected Object and Don't Invoke __wakeup() in Deserialization [ext/standard/tests/strings/bug72663_3.phpt]  XFAIL REASON: Memory leak, TBF later.
Bug #70470 (Built-in server truncates headers spanning over TCP packets) [sapi/cli/tests/bug70470.phpt]  XFAIL REASON: bug is not fixed yet
=====================================================================

=====================================================================
FAILED TEST SUMMARY
---------------------------------------------------------------------
Bug #64267 (CURLOPT_INFILE doesn't allow reset) [ext/curl/tests/bug64267.phpt]
Bug #71523 (Copied handle with new option CURLOPT_HTTPHEADER crashes while curl_multi_exec) [ext/curl/tests/bug71523.phpt]
Bug #65538: SSL context "cafile" disallows URL stream wrappers [ext/openssl/tests/bug65538_002.phpt]
ext/sockets - socket_bind - basic test [ext/sockets/tests/socket_bind.phpt]
int socket_send ( resource $socket , string $buf , int $len , int $flags ); [ext/sockets/tests/socket_send.phpt]
bool socket_shutdown ( resource $socket [, int $how = 2 ] ) ; [ext/sockets/tests/socket_shutdown.phpt]
gethostbyname() function - basic return valid ip address test [ext/standard/tests/network/gethostbyname_error004.phpt]
getmxrr() test [ext/standard/tests/network/getmxrr.phpt]
=====================================================================

=====================================================================
WARNED TEST SUMMARY
---------------------------------------------------------------------
zend multibyte (2) [ext/mbstring/tests/zend_multibyte-02.phpt] (warn: XFAIL section but test passes)
zend multibyte (6) [ext/mbstring/tests/zend_multibyte-06.phpt] (warn: XFAIL section but test passes)
zend multibyte (8) [ext/mbstring/tests/zend_multibyte-08.phpt] (warn: XFAIL section but test passes)
zend multibyte (10) [ext/mbstring/tests/zend_multibyte-10.phpt] (warn: XFAIL section but test passes)
zend multibyte (11) [ext/mbstring/tests/zend_multibyte-11.phpt] (warn: XFAIL section but test passes)
Phar: bug #69958: Segfault in Phar::convertToData on invalid file [ext/phar/tests/bug69958.phpt] (warn: XFAIL section but test passes)
Bug #69111 Crash in SessionHandler::read() [ext/session/tests/bug69111.phpt] (warn: XFAIL section but test passes)
Bug #70172 - Use After Free Vulnerability in unserialize() [ext/standard/tests/serialize/bug70172.phpt] (warn: XFAIL section but test passes)
=====================================================================


================================================================================
/root/pdisk/php-5.6.31/ext/curl/tests/bug64267.phpt
================================================================================
TEST
bool(true)
bool(true)
int(0)
===DONE===
================================================================================
004+ int(0)
004- int(30%d)
================================================================================



================================================================================
/root/pdisk/php-5.6.31/ext/curl/tests/bug71523.phpt
================================================================================
** ERROR: process timed out **
================================================================================
001+ ** ERROR: process timed out **
001- okey
================================================================================



================================================================================
/root/pdisk/php-5.6.31/ext/openssl/tests/bug65538_002.phpt
================================================================================
Warning: file_get_contents(): php_network_getaddresses: getaddrinfo failed: Temporary failure in name resolution in /root/pdisk/php-5.6.31/ext/openssl/tests/bug65538_002.php on line 5

Warning: file_get_contents(https://github.com): failed to open stream: php_network_getaddresses: getaddrinfo failed: Temporary failure in name resolution in /root/pdisk/php-5.6.31/ext/openssl/tests/bug65538_002.php on line 5
================================================================================
001+ Warning: file_get_contents(): php_network_getaddresses: getaddrinfo failed: Temporary failure in name resolution in /root/pdisk/php-5.6.31/ext/openssl/tests/bug65538_002.php on line 5
001- Warning: remote cafile streams are disabled for security purposes in %s on line %d
003+ Warning: file_get_contents(https://github.com): failed to open stream: php_network_getaddresses: getaddrinfo failed: Temporary failure in name resolution in /root/pdisk/php-5.6.31/ext/openssl/tests/bug65538_002.php on line 5
003- Warning: file_get_contents(): Failed to enable crypto in %s on line %d
004- 
005- Warning: file_get_contents(%s): failed to open stream: operation failed in %s on line %d
================================================================================



================================================================================
/root/pdisk/php-5.6.31/ext/sockets/tests/socket_bind.phpt
================================================================================
bool(true)

Warning: socket_connect(): Host lookup failed [-10002]: Host name lookup failure in /root/pdisk/php-5.6.31/ext/sockets/tests/socket_bind.php on line 8
bool(false)

Warning: socket_write(): unable to write to socket [32]: Broken pipe in /root/pdisk/php-5.6.31/ext/sockets/tests/socket_bind.php on line 13
bool(false)
NULL
================================================================================
002+ 
003+ Warning: socket_connect(): Host lookup failed [-10002]: Host name lookup failure in /root/pdisk/php-5.6.31/ext/sockets/tests/socket_bind.php on line 8
004+ bool(false)
005+ 
006+ Warning: socket_write(): unable to write to socket [32]: Broken pipe in /root/pdisk/php-5.6.31/ext/sockets/tests/socket_bind.php on line 13
007+ bool(false)
002- bool(true)
003- int(16)
================================================================================



================================================================================
/root/pdisk/php-5.6.31/ext/sockets/tests/socket_send.phpt
================================================================================
Warning: socket_connect(): Host lookup failed [-10002]: Host name lookup failure in /root/pdisk/php-5.6.31/ext/sockets/tests/socket_send.php on line 8

Warning: socket_send(): unable to write to socket [32]: Broken pipe in /root/pdisk/php-5.6.31/ext/sockets/tests/socket_send.php on line 10

Warning: socket_send(): unable to write to socket [32]: Broken pipe in /root/pdisk/php-5.6.31/ext/sockets/tests/socket_send.php on line 14

Warning: socket_send(): unable to write to socket [32]: Broken pipe in /root/pdisk/php-5.6.31/ext/sockets/tests/socket_send.php on line 18

Warning: socket_send(): unable to write to socket [32]: Broken pipe in /root/pdisk/php-5.6.31/ext/sockets/tests/socket_send.php on line 22
================================================================================
001+ Warning: socket_connect(): Host lookup failed [-10002]: Host name lookup failure in /root/pdisk/php-5.6.31/ext/sockets/tests/socket_send.php on line 8
002+ 
003+ Warning: socket_send(): unable to write to socket [32]: Broken pipe in /root/pdisk/php-5.6.31/ext/sockets/tests/socket_send.php on line 10
004+ 
001- okey
002- okey
003- okey
004- okey
005+ Warning: socket_send(): unable to write to socket [32]: Broken pipe in /root/pdisk/php-5.6.31/ext/sockets/tests/socket_send.php on line 14
006+ 
007+ Warning: socket_send(): unable to write to socket [32]: Broken pipe in /root/pdisk/php-5.6.31/ext/sockets/tests/socket_send.php on line 18
008+ 
009+ Warning: socket_send(): unable to write to socket [32]: Broken pipe in /root/pdisk/php-5.6.31/ext/sockets/tests/socket_send.php on line 22
================================================================================



================================================================================
/root/pdisk/php-5.6.31/ext/sockets/tests/socket_shutdown.phpt
================================================================================
Warning: socket_connect(): Host lookup failed [-10002]: Host name lookup failure in /root/pdisk/php-5.6.31/ext/sockets/tests/socket_shutdown.php on line 6

Warning: socket_shutdown(): unable to shutdown socket [107]: Transport endpoint is not connected in /root/pdisk/php-5.6.31/ext/sockets/tests/socket_shutdown.php on line 7
bool(false)

Warning: socket_connect(): Host lookup failed [-10002]: Host name lookup failure in /root/pdisk/php-5.6.31/ext/sockets/tests/socket_shutdown.php on line 11

Warning: socket_shutdown(): unable to shutdown socket [107]: Transport endpoint is not connected in /root/pdisk/php-5.6.31/ext/sockets/tests/socket_shutdown.php on line 12
bool(false)

Warning: socket_connect(): Host lookup failed [-10002]: Host name lookup failure in /root/pdisk/php-5.6.31/ext/sockets/tests/socket_shutdown.php on line 16

Warning: socket_shutdown(): unable to shutdown socket [107]: Transport endpoint is not connected in /root/pdisk/php-5.6.31/ext/sockets/tests/socket_shutdown.php on line 17
bool(false)

Warning: socket_shutdown(): unable to shutdown socket [107]: Transport endpoint is not connected in /root/pdisk/php-5.6.31/ext/sockets/tests/socket_shutdown.php on line 21
bool(false)

Warning: socket_connect(): Host lookup failed [-10002]: Host name lookup failure in /root/pdisk/php-5.6.31/ext/sockets/tests/socket_shutdown.php on line 23

Warning: socket_shutdown(): unable to shutdown socket [22]: Invalid argument in /root/pdisk/php-5.6.31/ext/sockets/tests/socket_shutdown.php on line 24
bool(false)
================================================================================
001+ Warning: socket_connect(): Host lookup failed [-10002]: Host name lookup failure in /root/pdisk/php-5.6.31/ext/sockets/tests/socket_shutdown.php on line 6
002+ 
003+ Warning: socket_shutdown(): unable to shutdown socket [107]: Transport endpoint is not connected in /root/pdisk/php-5.6.31/ext/sockets/tests/socket_shutdown.php on line 7
004+ bool(false)
005+ 
006+ Warning: socket_connect(): Host lookup failed [-10002]: Host name lookup failure in /root/pdisk/php-5.6.31/ext/sockets/tests/socket_shutdown.php on line 11
007+ 
008+ Warning: socket_shutdown(): unable to shutdown socket [107]: Transport endpoint is not connected in /root/pdisk/php-5.6.31/ext/sockets/tests/socket_shutdown.php on line 12
009+ bool(false)
010+ 
011+ Warning: socket_connect(): Host lookup failed [-10002]: Host name lookup failure in /root/pdisk/php-5.6.31/ext/sockets/tests/socket_shutdown.php on line 16
012+ 
013+ Warning: socket_shutdown(): unable to shutdown socket [107]: Transport endpoint is not connected in /root/pdisk/php-5.6.31/ext/sockets/tests/socket_shutdown.php on line 17
014+ bool(false)
001- bool(true)
002- bool(true)
003- bool(true)
019+ Warning: socket_connect(): Host lookup failed [-10002]: Host name lookup failure in /root/pdisk/php-5.6.31/ext/sockets/tests/socket_shutdown.php on line 23
020+ 
================================================================================



================================================================================
/root/pdisk/php-5.6.31/ext/standard/tests/network/gethostbyname_error004.phpt
================================================================================
bool(false)
================================================================================
001+ bool(false)
001- bool(true)
================================================================================



================================================================================
/root/pdisk/php-5.6.31/ext/standard/tests/network/getmxrr.phpt
================================================================================
** ERROR: process timed out **
================================================================================
001+ ** ERROR: process timed out **
001- Hosts: 1, weights: 1
002- Hosts: 2, weights: 2
================================================================================




================================================================================
BUILD ENVIRONMENT
================================================================================
OS:
Linux - Linux vm5.localdomain 2.6.32-504.23.4.el6.x86_64 #1 SMP Tue Jun 9 20:57:37 UTC 2015 x86_64

Autoconf:
autoconf (GNU Autoconf) 2.63
Copyright (C) 2008 Free Software Foundation, Inc.
License GPLv2+: GNU GPL version 2 or later
<http://gnu.org/licenses/old-licenses/gpl-2.0.html>
This is free software: you are free to change and redistribute it.
There is NO WARRANTY, to the extent permitted by law.

Written by David J. MacKenzie and Akim Demaille.

Bundled Libtool:
ltmain.sh (GNU libtool) 1.5.26 (1.1220.2.492 2008/01/30 06:40:56)

Copyright (C) 2008  Free Software Foundation, Inc.
This is free software; see the source for copying conditions.  There is NO
warranty; not even for MERCHANTABILITY or FITNESS FOR A PARTICULAR PURPOSE.

System Libtool:
N/A
Compiler:
Using built-in specs.
Target: x86_64-redhat-linux
Configured with: ../configure --prefix=/usr --mandir=/usr/share/man --infodir=/usr/share/info --with-bugurl=http://bugzilla.redhat.com/bugzilla --enable-bootstrap --enable-shared --enable-threads=posix --enable-checking=release --with-system-zlib --enable-__cxa_atexit --disable-libunwind-exceptions --enable-gnu-unique-object --enable-languages=c,c++,objc,obj-c++,java,fortran,ada --enable-java-awt=gtk --disable-dssi --with-java-home=/usr/lib/jvm/java-1.5.0-gcj-1.5.0.0/jre --enable-libgcj-multifile --enable-java-maintainer-mode --with-ecj-jar=/usr/share/java/eclipse-ecj.jar --disable-libjava-multilib --with-ppl --with-cloog --with-tune=generic --with-arch_32=i686 --build=x86_64-redhat-linux
Thread model: posix
gcc version 4.4.7 20120313 (Red Hat 4.4.7-11) (GCC) 

Bison:

Libraries:
	linux-vdso.so.1 =>  (0x00007fff30bb3000)
	libcrypt.so.1 => /lib64/libcrypt.so.1 (0x0000003d88000000)
	librt.so.1 => /lib64/librt.so.1 (0x0000003d7d000000)
	libmcrypt.so.4 => /root/pdisk/libmcrypt/lib/libmcrypt.so.4 (0x00007fc276e2e000)
	libpng12.so.0 => /usr/lib64/libpng12.so.0 (0x0000003d82000000)
	libz.so.1 => /lib64/libz.so.1 (0x0000003d7d400000)
	libcurl.so.4 => /usr/lib64/libcurl.so.4 (0x0000003d86c00000)
	libm.so.6 => /lib64/libm.so.6 (0x0000003d7d800000)
	libdl.so.2 => /lib64/libdl.so.2 (0x0000003d7c400000)
	libnsl.so.1 => /lib64/libnsl.so.1 (0x0000003d8c400000)
	libxml2.so.2 => /usr/lib64/libxml2.so.2 (0x0000003d87000000)
	libssl.so.10 => /usr/lib64/libssl.so.10 (0x0000003d8b000000)
	libcrypto.so.10 => /usr/lib64/libcrypto.so.10 (0x0000003d87c00000)
	libpthread.so.0 => /lib64/libpthread.so.0 (0x0000003d7cc00000)
	libc.so.6 => /lib64/libc.so.6 (0x0000003d7c800000)
	/lib64/ld-linux-x86-64.so.2 (0x0000003d7c000000)
	libresolv.so.2 => /lib64/libresolv.so.2 (0x0000003d7ec00000)
	libfreebl3.so => /lib64/libfreebl3.so (0x0000003d88400000)
	libidn.so.11 => /lib64/libidn.so.11 (0x0000003d7f000000)
	libldap-2.4.so.2 => /lib64/libldap-2.4.so.2 (0x0000003d8ec00000)
	libgssapi_krb5.so.2 => /lib64/libgssapi_krb5.so.2 (0x0000003d89c00000)
	libkrb5.so.3 => /lib64/libkrb5.so.3 (0x0000003d8a800000)
	libk5crypto.so.3 => /lib64/libk5crypto.so.3 (0x0000003d89800000)
	libcom_err.so.2 => /lib64/libcom_err.so.2 (0x0000003d89000000)
	libssl3.so => /usr/lib64/libssl3.so (0x0000003d8dc00000)
	libsmime3.so => /usr/lib64/libsmime3.so (0x0000003d8d400000)
	libnss3.so => /usr/lib64/libnss3.so (0x0000003d8c000000)
	libnssutil3.so => /usr/lib64/libnssutil3.so (0x0000003d8cc00000)
	libplds4.so => /lib64/libplds4.so (0x0000003d8b800000)
	libplc4.so => /lib64/libplc4.so (0x0000003d8b400000)
	libnspr4.so => /lib64/libnspr4.so (0x0000003d8bc00000)
	libssh2.so.1 => /usr/lib64/libssh2.so.1 (0x0000003d81000000)
	liblber-2.4.so.2 => /lib64/liblber-2.4.so.2 (0x0000003d8d000000)
	libsasl2.so.2 => /usr/lib64/libsasl2.so.2 (0x0000003d92c00000)
	libkrb5support.so.0 => /lib64/libkrb5support.so.0 (0x0000003d8a400000)
	libkeyutils.so.1 => /lib64/libkeyutils.so.1 (0x0000003d8a000000)
	libselinux.so.1 => /lib64/libselinux.so.1 (0x0000003d7e000000)



================================================================================
PHPINFO
================================================================================
phpinfo()
PHP Version => 5.6.31

System => Linux vm5.localdomain 2.6.32-504.23.4.el6.x86_64 #1 SMP Tue Jun 9 20:57:37 UTC 2015 x86_64
Build Date => Sep 14 2017 08:55:22
Configure Command =>  './configure'  '--prefix=/root/pdisk/php' '--with-config-file-path=/root/pdisk/php/etc' '--with-libxml-dir=/usr/lib64' '--with-mysql=mysqlnd' '--with-mysqli=mysqlnd' '--with-pdo-mysql=mysqlnd' '--with-apxs2=/root/pdisk/httpd/apache/bin/apxs' '--enable-sysvsem' '--with-curl' '--enable-mbregex' '--enable-mbstring' '--with-mcrypt=/root/pdisk/libmcrypt' '--with-gd' '--with-openssl' '--with-mhash' '--enable-sockets' '--with-xmlrpc' '--with-zlib' '--enable-pdo'
Server API => Command Line Interface
Virtual Directory Support => enabled
Configuration File (php.ini) Path => /root/pdisk/php/etc
Loaded Configuration File => (none)
Scan this dir for additional .ini files => (none)
Additional .ini files parsed => (none)
PHP API => 20131106
PHP Extension => 20131226
Zend Extension => 220131226
Zend Extension Build => API220131226,TS
PHP Extension Build => API20131226,TS
Debug Build => no
Thread Safety => enabled
Zend Signal Handling => disabled
Zend Memory Manager => enabled
Zend Multibyte Support => provided by mbstring
IPv6 Support => enabled
DTrace Support => disabled

Registered PHP Streams => https, ftps, compress.zlib, php, file, glob, data, http, ftp, phar
Registered Stream Socket Transports => tcp, udp, unix, udg, ssl, sslv3, sslv2, tls, tlsv1.0, tlsv1.1, tlsv1.2
Registered Stream Filters => zlib.*, convert.iconv.*, mcrypt.*, mdecrypt.*, string.rot13, string.toupper, string.tolower, string.strip_tags, convert.*, consumed, dechunk

This program makes use of the Zend Scripting Language Engine:
Zend Engine v2.6.0, Copyright (c) 1998-2016 Zend Technologies


 _______________________________________________________________________


Configuration

Core

PHP Version => 5.6.31

Directive => Local Value => Master Value
allow_url_fopen => On => On
allow_url_include => Off => Off
always_populate_raw_post_data => 0 => 0
arg_separator.input => & => &
arg_separator.output => & => &
asp_tags => Off => Off
auto_append_file => no value => no value
auto_globals_jit => On => On
auto_prepend_file => no value => no value
browscap => no value => no value
default_charset => UTF-8 => UTF-8
default_mimetype => text/html => text/html
disable_classes => no value => no value
disable_functions => no value => no value
display_errors => STDERR => STDERR
display_startup_errors => Off => Off
doc_root => no value => no value
docref_ext => no value => no value
docref_root => no value => no value
enable_dl => On => On
enable_post_data_reading => On => On
error_append_string => no value => no value
error_log => no value => no value
error_prepend_string => no value => no value
error_reporting => no value => no value
exit_on_timeout => Off => Off
expose_php => On => On
extension_dir => /root/pdisk/php/lib/php/extensions/no-debug-zts-20131226 => /root/pdisk/php/lib/php/extensions/no-debug-zts-20131226
file_uploads => On => On
highlight.comment => <font style="color: #FF8000">#FF8000</font> => <font style="color: #FF8000">#FF8000</font>
highlight.default => <font style="color: #0000BB">#0000BB</font> => <font style="color: #0000BB">#0000BB</font>
highlight.html => <font style="color: #000000">#000000</font> => <font style="color: #000000">#000000</font>
highlight.keyword => <font style="color: #007700">#007700</font> => <font style="color: #007700">#007700</font>
highlight.string => <font style="color: #DD0000">#DD0000</font> => <font style="color: #DD0000">#DD0000</font>
html_errors => Off => Off
ignore_repeated_errors => Off => Off
ignore_repeated_source => Off => Off
ignore_user_abort => Off => Off
implicit_flush => On => On
include_path => .:/root/pdisk/php/lib/php => .:/root/pdisk/php/lib/php
input_encoding => no value => no value
internal_encoding => no value => no value
log_errors => Off => Off
log_errors_max_len => 1024 => 1024
mail.add_x_header => Off => Off
mail.force_extra_parameters => no value => no value
mail.log => no value => no value
max_execution_time => 0 => 0
max_file_uploads => 20 => 20
max_input_nesting_level => 64 => 64
max_input_time => -1 => -1
max_input_vars => 1000 => 1000
memory_limit => 128M => 128M
open_basedir => no value => no value
output_buffering => 0 => 0
output_encoding => no value => no value
output_handler => no value => no value
post_max_size => 8M => 8M
precision => 14 => 14
realpath_cache_size => 16K => 16K
realpath_cache_ttl => 120 => 120
register_argc_argv => On => On
report_memleaks => On => On
report_zend_debug => Off => Off
request_order => no value => no value
sendmail_from => no value => no value
sendmail_path =>  -t -i  =>  -t -i 
serialize_precision => 17 => 17
short_open_tag => On => On
SMTP => localhost => localhost
smtp_port => 25 => 25
sql.safe_mode => Off => Off
sys_temp_dir => no value => no value
track_errors => Off => Off
unserialize_callback_func => no value => no value
upload_max_filesize => 2M => 2M
upload_tmp_dir => no value => no value
user_dir => no value => no value
user_ini.cache_ttl => 300 => 300
user_ini.filename => .user.ini => .user.ini
variables_order => EGPCS => EGPCS
xmlrpc_error_number => 0 => 0
xmlrpc_errors => Off => Off
zend.detect_unicode => On => On
zend.enable_gc => On => On
zend.multibyte => Off => Off
zend.script_encoding => no value => no value

ctype

ctype functions => enabled

curl

cURL support => enabled
cURL Information => 7.19.7
Age => 3
Features
AsynchDNS => No
CharConv => No
Debug => No
GSS-Negotiate => Yes
IDN => Yes
IPv6 => Yes
krb4 => No
Largefile => Yes
libz => Yes
NTLM => Yes
SPNEGO => No
SSL => Yes
SSPI => No
Protocols => tftp, ftp, telnet, dict, ldap, ldaps, http, file, https, ftps, scp, sftp
Host => x86_64-redhat-linux-gnu
SSL Version => NSS/3.16.2.3 Basic ECC
ZLib Version => 1.2.3
libSSH Version => libssh2/1.4.2

date

date/time support => enabled
"Olson" Timezone Database Version => 2016.10
Timezone Database => internal
Default timezone => UTC

Directive => Local Value => Master Value
date.default_latitude => 31.7667 => 31.7667
date.default_longitude => 35.2333 => 35.2333
date.sunrise_zenith => 90.583333 => 90.583333
date.sunset_zenith => 90.583333 => 90.583333
date.timezone => no value => no value

dom

DOM/XML => enabled
DOM/XML API Version => 20031129
libxml Version => 2.7.6
HTML Support => enabled
XPath Support => enabled
XPointer Support => enabled
Schema Support => enabled
RelaxNG Support => enabled

ereg

Regex Library => Bundled library enabled

fileinfo

fileinfo support => enabled
version => 1.0.5
libmagic => 517

filter

Input Validation and Filtering => enabled
Revision => $Id: 5b79667bd9a68977a9b4f7505223a8e216e04908 $

Directive => Local Value => Master Value
filter.default => unsafe_raw => unsafe_raw
filter.default_flags => no value => no value

gd

GD Support => enabled
GD Version => bundled (2.1.0 compatible)
GIF Read Support => enabled
GIF Create Support => enabled
PNG Support => enabled
libPNG Version => 1.2.49
WBMP Support => enabled
XBM Support => enabled

Directive => Local Value => Master Value
gd.jpeg_ignore_warning => 0 => 0

hash

hash support => enabled
Hashing Engines => md2 md4 md5 sha1 sha224 sha256 sha384 sha512 ripemd128 ripemd160 ripemd256 ripemd320 whirlpool tiger128,3 tiger160,3 tiger192,3 tiger128,4 tiger160,4 tiger192,4 snefru snefru256 gost gost-crypto adler32 crc32 crc32b fnv132 fnv1a32 fnv164 fnv1a64 joaat haval128,3 haval160,3 haval192,3 haval224,3 haval256,3 haval128,4 haval160,4 haval192,4 haval224,4 haval256,4 haval128,5 haval160,5 haval192,5 haval224,5 haval256,5 

iconv

iconv support => enabled
iconv implementation => glibc
iconv library version => 2.12

Directive => Local Value => Master Value
iconv.input_encoding => no value => no value
iconv.internal_encoding => no value => no value
iconv.output_encoding => no value => no value

json

json support => enabled
json version => 1.2.1

libxml

libXML support => active
libXML Compiled Version => 2.7.6
libXML Loaded Version => 20706
libXML streams => enabled

mbstring

Multibyte Support => enabled
Multibyte string engine => libmbfl
HTTP input encoding translation => disabled
libmbfl version => 1.3.2

mbstring extension makes use of "streamable kanji code filter and converter", which is distributed under the GNU Lesser General Public License version 2.1.

Multibyte (japanese) regex support => enabled
Multibyte regex (oniguruma) backtrack check => On
Multibyte regex (oniguruma) version => 5.9.5

Directive => Local Value => Master Value
mbstring.detect_order => no value => no value
mbstring.encoding_translation => Off => Off
mbstring.func_overload => 0 => 0
mbstring.http_input => no value => no value
mbstring.http_output => no value => no value
mbstring.http_output_conv_mimetypes => ^(text/|application/xhtml\+xml) => ^(text/|application/xhtml\+xml)
mbstring.internal_encoding => no value => no value
mbstring.language => neutral => neutral
mbstring.strict_detection => Off => Off
mbstring.substitute_character => no value => no value

mcrypt

mcrypt support => enabled
mcrypt_filter support => enabled
Version => 2.5.8
Api No => 20021217
Supported ciphers => cast-128 gost rijndael-128 twofish arcfour cast-256 loki97 rijndael-192 saferplus wake blowfish-compat des rijndael-256 serpent xtea blowfish enigma rc2 tripledes 
Supported modes => cbc cfb ctr ecb ncfb nofb ofb stream 

Directive => Local Value => Master Value
mcrypt.algorithms_dir => no value => no value
mcrypt.modes_dir => no value => no value

mysql

MySQL Support => enabled
Active Persistent Links => 0
Active Links => 0
Client API version => mysqlnd 5.0.11-dev - 20120503 - $Id: 76b08b24596e12d4553bd41fc93cccd5bac2fe7a $

Directive => Local Value => Master Value
mysql.allow_local_infile => On => On
mysql.allow_persistent => On => On
mysql.connect_timeout => 60 => 60
mysql.default_host => no value => no value
mysql.default_password => no value => no value
mysql.default_port => no value => no value
mysql.default_socket => no value => no value
mysql.default_user => no value => no value
mysql.max_links => Unlimited => Unlimited
mysql.max_persistent => Unlimited => Unlimited
mysql.trace_mode => Off => Off

mysqli

MysqlI Support => enabled
Client API library version => mysqlnd 5.0.11-dev - 20120503 - $Id: 76b08b24596e12d4553bd41fc93cccd5bac2fe7a $
Active Persistent Links => 0
Inactive Persistent Links => 0
Active Links => 0

Directive => Local Value => Master Value
mysqli.allow_local_infile => On => On
mysqli.allow_persistent => On => On
mysqli.default_host => no value => no value
mysqli.default_port => 3306 => 3306
mysqli.default_pw => no value => no value
mysqli.default_socket => no value => no value
mysqli.default_user => no value => no value
mysqli.max_links => Unlimited => Unlimited
mysqli.max_persistent => Unlimited => Unlimited
mysqli.reconnect => Off => Off
mysqli.rollback_on_cached_plink => Off => Off

mysqlnd

mysqlnd => enabled
Version => mysqlnd 5.0.11-dev - 20120503 - $Id: 76b08b24596e12d4553bd41fc93cccd5bac2fe7a $
Compression => not supported
core SSL => supported
extended SSL => not supported
Command buffer size => 4096
Read buffer size => 32768
Read timeout => 31536000
Collecting statistics => Yes
Collecting memory statistics => No
Tracing => n/a
Loaded plugins => mysqlnd,debug_trace,auth_plugin_mysql_native_password,auth_plugin_mysql_clear_password
API Extensions => pdo_mysql,mysqli,mysql

mysqlnd statistics =>  
bytes_sent => 0
bytes_received => 0
packets_sent => 0
packets_received => 0
protocol_overhead_in => 0
protocol_overhead_out => 0
bytes_received_ok_packet => 0
bytes_received_eof_packet => 0
bytes_received_rset_header_packet => 0
bytes_received_rset_field_meta_packet => 0
bytes_received_rset_row_packet => 0
bytes_received_prepare_response_packet => 0
bytes_received_change_user_packet => 0
packets_sent_command => 0
packets_received_ok => 0
packets_received_eof => 0
packets_received_rset_header => 0
packets_received_rset_field_meta => 0
packets_received_rset_row => 0
packets_received_prepare_response => 0
packets_received_change_user => 0
result_set_queries => 0
non_result_set_queries => 0
no_index_used => 0
bad_index_used => 0
slow_queries => 0
buffered_sets => 0
unbuffered_sets => 0
ps_buffered_sets => 0
ps_unbuffered_sets => 0
flushed_normal_sets => 0
flushed_ps_sets => 0
ps_prepared_never_executed => 0
ps_prepared_once_executed => 0
rows_fetched_from_server_normal => 0
rows_fetched_from_server_ps => 0
rows_buffered_from_client_normal => 0
rows_buffered_from_client_ps => 0
rows_fetched_from_client_normal_buffered => 0
rows_fetched_from_client_normal_unbuffered => 0
rows_fetched_from_client_ps_buffered => 0
rows_fetched_from_client_ps_unbuffered => 0
rows_fetched_from_client_ps_cursor => 0
rows_affected_normal => 0
rows_affected_ps => 0
rows_skipped_normal => 0
rows_skipped_ps => 0
copy_on_write_saved => 0
copy_on_write_performed => 0
command_buffer_too_small => 0
connect_success => 0
connect_failure => 0
connection_reused => 0
reconnect => 0
pconnect_success => 0
active_connections => 0
active_persistent_connections => 0
explicit_close => 0
implicit_close => 0
disconnect_close => 0
in_middle_of_command_close => 0
explicit_free_result => 0
implicit_free_result => 0
explicit_stmt_close => 0
implicit_stmt_close => 0
mem_emalloc_count => 0
mem_emalloc_amount => 0
mem_ecalloc_count => 0
mem_ecalloc_amount => 0
mem_erealloc_count => 0
mem_erealloc_amount => 0
mem_efree_count => 0
mem_efree_amount => 0
mem_malloc_count => 0
mem_malloc_amount => 0
mem_calloc_count => 0
mem_calloc_amount => 0
mem_realloc_count => 0
mem_realloc_amount => 0
mem_free_count => 0
mem_free_amount => 0
mem_estrndup_count => 0
mem_strndup_count => 0
mem_estndup_count => 0
mem_strdup_count => 0
proto_text_fetched_null => 0
proto_text_fetched_bit => 0
proto_text_fetched_tinyint => 0
proto_text_fetched_short => 0
proto_text_fetched_int24 => 0
proto_text_fetched_int => 0
proto_text_fetched_bigint => 0
proto_text_fetched_decimal => 0
proto_text_fetched_float => 0
proto_text_fetched_double => 0
proto_text_fetched_date => 0
proto_text_fetched_year => 0
proto_text_fetched_time => 0
proto_text_fetched_datetime => 0
proto_text_fetched_timestamp => 0
proto_text_fetched_string => 0
proto_text_fetched_blob => 0
proto_text_fetched_enum => 0
proto_text_fetched_set => 0
proto_text_fetched_geometry => 0
proto_text_fetched_other => 0
proto_binary_fetched_null => 0
proto_binary_fetched_bit => 0
proto_binary_fetched_tinyint => 0
proto_binary_fetched_short => 0
proto_binary_fetched_int24 => 0
proto_binary_fetched_int => 0
proto_binary_fetched_bigint => 0
proto_binary_fetched_decimal => 0
proto_binary_fetched_float => 0
proto_binary_fetched_double => 0
proto_binary_fetched_date => 0
proto_binary_fetched_year => 0
proto_binary_fetched_time => 0
proto_binary_fetched_datetime => 0
proto_binary_fetched_timestamp => 0
proto_binary_fetched_string => 0
proto_binary_fetched_json => 0
proto_binary_fetched_blob => 0
proto_binary_fetched_enum => 0
proto_binary_fetched_set => 0
proto_binary_fetched_geometry => 0
proto_binary_fetched_other => 0
init_command_executed_count => 0
init_command_failed_count => 0
com_quit => 0
com_init_db => 0
com_query => 0
com_field_list => 0
com_create_db => 0
com_drop_db => 0
com_refresh => 0
com_shutdown => 0
com_statistics => 0
com_process_info => 0
com_connect => 0
com_process_kill => 0
com_debug => 0
com_ping => 0
com_time => 0
com_delayed_insert => 0
com_change_user => 0
com_binlog_dump => 0
com_table_dump => 0
com_connect_out => 0
com_register_slave => 0
com_stmt_prepare => 0
com_stmt_execute => 0
com_stmt_send_long_data => 0
com_stmt_close => 0
com_stmt_reset => 0
com_stmt_set_option => 0
com_stmt_fetch => 0
com_deamon => 0
bytes_received_real_data_normal => 0
bytes_received_real_data_ps => 0

openssl

OpenSSL support => enabled
OpenSSL Library Version => OpenSSL 1.0.1e-fips 11 Feb 2013
OpenSSL Header Version => OpenSSL 1.0.1e-fips 11 Feb 2013
Openssl default config => /etc/pki/tls/openssl.cnf

Directive => Local Value => Master Value
openssl.cafile => no value => no value
openssl.capath => no value => no value

pcre

PCRE (Perl Compatible Regular Expressions) Support => enabled
PCRE Library Version => 8.38 2015-11-23

Directive => Local Value => Master Value
pcre.backtrack_limit => 1000000 => 1000000
pcre.recursion_limit => 100000 => 100000

PDO

PDO support => enabled
PDO drivers => mysql, sqlite

pdo_mysql

PDO Driver for MySQL => enabled
Client API version => mysqlnd 5.0.11-dev - 20120503 - $Id: 76b08b24596e12d4553bd41fc93cccd5bac2fe7a $

Directive => Local Value => Master Value
pdo_mysql.default_socket => /tmp/mysql.sock => /tmp/mysql.sock

pdo_sqlite

PDO Driver for SQLite 3.x => enabled
SQLite Library => 3.8.10.2

Phar

Phar: PHP Archive support => enabled
Phar EXT version => 2.0.2
Phar API version => 1.1.1
SVN revision => $Id: 780be432570e80dd34c1a9c217ef87ade22bf136 $
Phar-based phar archives => enabled
Tar-based phar archives => enabled
ZIP-based phar archives => enabled
gzip compression => enabled
bzip2 compression => disabled (install pecl/bz2)
OpenSSL support => enabled


Phar based on pear/PHP_Archive, original concept by Davey Shafik.
Phar fully realized by Gregory Beaver and Marcus Boerger.
Portions of tar implementation Copyright (c) 2003-2009 Tim Kientzle.
Directive => Local Value => Master Value
phar.cache_list => no value => no value
phar.readonly => On => On
phar.require_hash => On => On

posix

Revision => $Id: 5f4acc20904b1406142f2a0ede068db048c77e77 $

Reflection

Reflection => enabled
Version => $Id: 5f15287237d5f78d75b19c26915aa7bd83dee8b8 $

session

Session Support => enabled
Registered save handlers => files user 
Registered serializer handlers => php_serialize php php_binary 

Directive => Local Value => Master Value
session.auto_start => Off => Off
session.cache_expire => 180 => 180
session.cache_limiter => nocache => nocache
session.cookie_domain => no value => no value
session.cookie_httponly => Off => Off
session.cookie_lifetime => 0 => 0
session.cookie_path => / => /
session.cookie_secure => Off => Off
session.entropy_file => /dev/urandom => /dev/urandom
session.entropy_length => 32 => 32
session.gc_divisor => 100 => 100
session.gc_maxlifetime => 1440 => 1440
session.gc_probability => 1 => 1
session.hash_bits_per_character => 4 => 4
session.hash_function => 0 => 0
session.name => PHPSESSID => PHPSESSID
session.referer_check => no value => no value
session.save_handler => files => files
session.save_path => no value => no value
session.serialize_handler => php => php
session.upload_progress.cleanup => On => On
session.upload_progress.enabled => On => On
session.upload_progress.freq => 1% => 1%
session.upload_progress.min_freq => 1 => 1
session.upload_progress.name => PHP_SESSION_UPLOAD_PROGRESS => PHP_SESSION_UPLOAD_PROGRESS
session.upload_progress.prefix => upload_progress_ => upload_progress_
session.use_cookies => On => On
session.use_only_cookies => On => On
session.use_strict_mode => Off => Off
session.use_trans_sid => 0 => 0

SimpleXML

Simplexml support => enabled
Revision => $Id: d7077fc935154236afb4fe70814ba358efdbdca4 $
Schema support => enabled

sockets

Sockets Support => enabled

SPL

SPL support => enabled
Interfaces => Countable, OuterIterator, RecursiveIterator, SeekableIterator, SplObserver, SplSubject
Classes => AppendIterator, ArrayIterator, ArrayObject, BadFunctionCallException, BadMethodCallException, CachingIterator, CallbackFilterIterator, DirectoryIterator, DomainException, EmptyIterator, FilesystemIterator, FilterIterator, GlobIterator, InfiniteIterator, InvalidArgumentException, IteratorIterator, LengthException, LimitIterator, LogicException, MultipleIterator, NoRewindIterator, OutOfBoundsException, OutOfRangeException, OverflowException, ParentIterator, RangeException, RecursiveArrayIterator, RecursiveCachingIterator, RecursiveCallbackFilterIterator, RecursiveDirectoryIterator, RecursiveFilterIterator, RecursiveIteratorIterator, RecursiveRegexIterator, RecursiveTreeIterator, RegexIterator, RuntimeException, SplDoublyLinkedList, SplFileInfo, SplFileObject, SplFixedArray, SplHeap, SplMinHeap, SplMaxHeap, SplObjectStorage, SplPriorityQueue, SplQueue, SplStack, SplTempFileObject, UnderflowException, UnexpectedValueException

sqlite3

SQLite3 support => enabled
SQLite3 module version => 0.7-dev
SQLite Library => 3.8.10.2

Directive => Local Value => Master Value
sqlite3.extension_dir => no value => no value

standard

Dynamic Library Support => enabled
Path to sendmail =>  -t -i 

Directive => Local Value => Master Value
assert.active => 1 => 1
assert.bail => 0 => 0
assert.callback => no value => no value
assert.quiet_eval => 0 => 0
assert.warning => 1 => 1
auto_detect_line_endings => 0 => 0
default_socket_timeout => 60 => 60
from => no value => no value
url_rewriter.tags => a=href,area=href,frame=src,form=,fieldset= => a=href,area=href,frame=src,form=,fieldset=
user_agent => no value => no value

tokenizer

Tokenizer Support => enabled

xml

XML Support => active
XML Namespace Support => active
libxml2 Version => 2.7.6

xmlreader

XMLReader => enabled

xmlrpc

core library version => xmlrpc-epi v. 0.51
php extension version => 0.51
author => Dan Libby
homepage => http://xmlrpc-epi.sourceforge.net
open sourced by => Epinions.com

xmlwriter

XMLWriter => enabled

zlib

ZLib Support => enabled
Stream Wrapper => compress.zlib://
Stream Filter => zlib.inflate, zlib.deflate
Compiled Version => 1.2.3
Linked Version => 1.2.3

Directive => Local Value => Master Value
zlib.output_compression => Off => Off
zlib.output_compression_level => -1 => -1
zlib.output_handler => no value => no value

Additional Modules

Module Name
sysvsem

Environment

Variable => Value
ORBIT_SOCKETDIR => /tmp/orbit-root
SSH_AGENT_PID => 2160
TEST_PHP_SRCDIR => /root/pdisk/php-5.6.31
GIO_LAUNCHED_DESKTOP_FILE_PID => 15486
IMSETTINGS_INTEGRATE_DESKTOP => yes
SHELL => /bin/bash
TERM => xterm
XDG_SESSION_COOKIE => 4624ca90a9658cc72b88287800000012-1504933326.665770-601106906
MAKEFLAGS =>  
SSH_CLIENT => deleted
GTK_RC_FILES => /etc/gtk/gtkrc:/root/.gtkrc-1.2-gnome2
WINDOWID => 58859573
OLDPWD => /root/pdisk/php-5.6.31
QTDIR => /usr/lib64/qt-3.3
QTINC => /usr/lib64/qt-3.3/include
SSH_TTY => deleted
IMSETTINGS_MODULE => none
USER => root
LS_COLORS => rs=0:di=01;34:ln=01;36:mh=00:pi=40;33:so=01;35:do=01;35:bd=40;33;01:cd=40;33;01:or=40;31;01:mi=01;05;37;41:su=37;41:sg=30;43:ca=30;41:tw=30;42:ow=34;42:st=37;44:ex=01;32:*.tar=01;31:*.tgz=01;31:*.arj=01;31:*.taz=01;31:*.lzh=01;31:*.lzma=01;31:*.tlz=01;31:*.txz=01;31:*.zip=01;31:*.z=01;31:*.Z=01;31:*.dz=01;31:*.gz=01;31:*.lz=01;31:*.xz=01;31:*.bz2=01;31:*.tbz=01;31:*.tbz2=01;31:*.bz=01;31:*.tz=01;31:*.deb=01;31:*.rpm=01;31:*.jar=01;31:*.rar=01;31:*.ace=01;31:*.zoo=01;31:*.cpio=01;31:*.7z=01;31:*.rz=01;31:*.jpg=01;35:*.jpeg=01;35:*.gif=01;35:*.bmp=01;35:*.pbm=01;35:*.pgm=01;35:*.ppm=01;35:*.tga=01;35:*.xbm=01;35:*.xpm=01;35:*.tif=01;35:*.tiff=01;35:*.png=01;35:*.svg=01;35:*.svgz=01;35:*.mng=01;35:*.pcx=01;35:*.mov=01;35:*.mpg=01;35:*.mpeg=01;35:*.m2v=01;35:*.mkv=01;35:*.ogm=01;35:*.mp4=01;35:*.m4v=01;35:*.mp4v=01;35:*.vob=01;35:*.qt=01;35:*.nuv=01;35:*.wmv=01;35:*.asf=01;35:*.rm=01;35:*.rmvb=01;35:*.flc=01;35:*.avi=01;35:*.fli=01;35:*.flv=01;35:*.gl=01;35:*.dl=01;35:*.xcf=01;35:*.xwd=01;35:*.yuv=01;35:*.cgm=01;35:*.emf=01;35:*.axv=01;35:*.anx=01;35:*.ogv=01;35:*.ogx=01;35:*.aac=01;36:*.au=01;36:*.flac=01;36:*.mid=01;36:*.midi=01;36:*.mka=01;36:*.mp3=01;36:*.mpc=01;36:*.ogg=01;36:*.ra=01;36:*.wav=01;36:*.axa=01;36:*.oga=01;36:*.spx=01;36:*.xspf=01;36:
HBASE_HOME => /root/pdisk/hbase-1.0.3
GNOME_KEYRING_SOCKET => /tmp/keyring-gLpnjb/socket
SSH_AUTH_SOCK => deleted
SESSION_MANAGER => local/unix:@/tmp/.ICE-unix/2159,unix/unix:/tmp/.ICE-unix/2159
MAKELEVEL => 1
GIO_LAUNCHED_DESKTOP_FILE => /root/Desktop/gnome-terminal.desktop
MFLAGS =>  
PATH => /usr/lib64/qt-3.3/bin:/root/pdisk/jdk1.7.0_80/bin:/root/pdisk/hbase-1.0.3/bin:/bin:/usr/bin:/usr/X11R6/bin:/usr/local/bin:/sbin:/usr/sbin:/root/pdisk
QT_IM_MODULE => xim
PWD => /root/pdisk/php-5.6.31
XMODIFIERS => @im=none
JAVA_HOME => /root/pdisk/jdk1.7.0_80
LANG => en_US.UTF-8
TEST_PHP_EXECUTABLE => /root/pdisk/php-5.6.31/sapi/cli/php
SSH_ASKPASS => /usr/libexec/openssh/gnome-ssh-askpass
HOME => /root
SHLVL => 3
GNOME_DESKTOP_SESSION_ID => this-is-deprecated
QTLIB => /usr/lib64/qt-3.3/lib
CVS_RSH => ssh
SSH_CONNECTION => deleted
DBUS_SESSION_BUS_ADDRESS => unix:abstract=/tmp/dbus-oh9E5u1JEW,guid=562bb4244c101a47a4a447ed000000d1
CLASSPATH => .:/root/pdisk/jdk1.7.0_80/lib/dt.jar:/root/pdisk/jdk1.7.0_80/lib/tools.jar
UID => 0
LESSOPEN => ||/usr/bin/lesspipe.sh %s
DISPLAY => :10.0
CC => /root/pdisk/php-5.6.31/meta_ccld
GTK_IM_MODULE => gtk-im-context-simple
G_BROKEN_FILENAMES => 1
COLORTERM => gnome-terminal
_ => /root/pdisk/php-5.6.31/sapi/cli/php

PHP Variables

Variable => Value
_SERVER["ORBIT_SOCKETDIR"] => /tmp/orbit-root
_SERVER["SSH_AGENT_PID"] => 2160
_SERVER["TEST_PHP_SRCDIR"] => /root/pdisk/php-5.6.31
_SERVER["GIO_LAUNCHED_DESKTOP_FILE_PID"] => 15486
_SERVER["IMSETTINGS_INTEGRATE_DESKTOP"] => yes
_SERVER["SHELL"] => /bin/bash
_SERVER["TERM"] => xterm
_SERVER["XDG_SESSION_COOKIE"] => 4624ca90a9658cc72b88287800000012-1504933326.665770-601106906
_SERVER["MAKEFLAGS"] => 
_SERVER["SSH_CLIENT"] => deleted
_SERVER["GTK_RC_FILES"] => /etc/gtk/gtkrc:/root/.gtkrc-1.2-gnome2
_SERVER["WINDOWID"] => 58859573
_SERVER["OLDPWD"] => /root/pdisk/php-5.6.31
_SERVER["QTDIR"] => /usr/lib64/qt-3.3
_SERVER["QTINC"] => /usr/lib64/qt-3.3/include
_SERVER["SSH_TTY"] => deleted
_SERVER["IMSETTINGS_MODULE"] => none
_SERVER["USER"] => root
_SERVER["LS_COLORS"] => rs=0:di=01;34:ln=01;36:mh=00:pi=40;33:so=01;35:do=01;35:bd=40;33;01:cd=40;33;01:or=40;31;01:mi=01;05;37;41:su=37;41:sg=30;43:ca=30;41:tw=30;42:ow=34;42:st=37;44:ex=01;32:*.tar=01;31:*.tgz=01;31:*.arj=01;31:*.taz=01;31:*.lzh=01;31:*.lzma=01;31:*.tlz=01;31:*.txz=01;31:*.zip=01;31:*.z=01;31:*.Z=01;31:*.dz=01;31:*.gz=01;31:*.lz=01;31:*.xz=01;31:*.bz2=01;31:*.tbz=01;31:*.tbz2=01;31:*.bz=01;31:*.tz=01;31:*.deb=01;31:*.rpm=01;31:*.jar=01;31:*.rar=01;31:*.ace=01;31:*.zoo=01;31:*.cpio=01;31:*.7z=01;31:*.rz=01;31:*.jpg=01;35:*.jpeg=01;35:*.gif=01;35:*.bmp=01;35:*.pbm=01;35:*.pgm=01;35:*.ppm=01;35:*.tga=01;35:*.xbm=01;35:*.xpm=01;35:*.tif=01;35:*.tiff=01;35:*.png=01;35:*.svg=01;35:*.svgz=01;35:*.mng=01;35:*.pcx=01;35:*.mov=01;35:*.mpg=01;35:*.mpeg=01;35:*.m2v=01;35:*.mkv=01;35:*.ogm=01;35:*.mp4=01;35:*.m4v=01;35:*.mp4v=01;35:*.vob=01;35:*.qt=01;35:*.nuv=01;35:*.wmv=01;35:*.asf=01;35:*.rm=01;35:*.rmvb=01;35:*.flc=01;35:*.avi=01;35:*.fli=01;35:*.flv=01;35:*.gl=01;35:*.dl=01;35:*.xcf=01;35:*.xwd=01;35:*.yuv=01;35:*.cgm=01;35:*.emf=01;35:*.axv=01;35:*.anx=01;35:*.ogv=01;35:*.ogx=01;35:*.aac=01;36:*.au=01;36:*.flac=01;36:*.mid=01;36:*.midi=01;36:*.mka=01;36:*.mp3=01;36:*.mpc=01;36:*.ogg=01;36:*.ra=01;36:*.wav=01;36:*.axa=01;36:*.oga=01;36:*.spx=01;36:*.xspf=01;36:
_SERVER["HBASE_HOME"] => /root/pdisk/hbase-1.0.3
_SERVER["GNOME_KEYRING_SOCKET"] => /tmp/keyring-gLpnjb/socket
_SERVER["SSH_AUTH_SOCK"] => deleted
_SERVER["SESSION_MANAGER"] => local/unix:@/tmp/.ICE-unix/2159,unix/unix:/tmp/.ICE-unix/2159
_SERVER["MAKELEVEL"] => 1
_SERVER["GIO_LAUNCHED_DESKTOP_FILE"] => /root/Desktop/gnome-terminal.desktop
_SERVER["MFLAGS"] => 
_SERVER["PATH"] => /usr/lib64/qt-3.3/bin:/root/pdisk/jdk1.7.0_80/bin:/root/pdisk/hbase-1.0.3/bin:/bin:/usr/bin:/usr/X11R6/bin:/usr/local/bin:/sbin:/usr/sbin:/root/pdisk
_SERVER["QT_IM_MODULE"] => xim
_SERVER["PWD"] => /root/pdisk/php-5.6.31
_SERVER["XMODIFIERS"] => @im=none
_SERVER["JAVA_HOME"] => /root/pdisk/jdk1.7.0_80
_SERVER["LANG"] => en_US.UTF-8
_SERVER["TEST_PHP_EXECUTABLE"] => /root/pdisk/php-5.6.31/sapi/cli/php
_SERVER["SSH_ASKPASS"] => /usr/libexec/openssh/gnome-ssh-askpass
_SERVER["HOME"] => /root
_SERVER["SHLVL"] => 3
_SERVER["GNOME_DESKTOP_SESSION_ID"] => this-is-deprecated
_SERVER["QTLIB"] => /usr/lib64/qt-3.3/lib
_SERVER["CVS_RSH"] => ssh
_SERVER["SSH_CONNECTION"] => deleted
_SERVER["DBUS_SESSION_BUS_ADDRESS"] => unix:abstract=/tmp/dbus-oh9E5u1JEW,guid=562bb4244c101a47a4a447ed000000d1
_SERVER["CLASSPATH"] => .:/root/pdisk/jdk1.7.0_80/lib/dt.jar:/root/pdisk/jdk1.7.0_80/lib/tools.jar
_SERVER["UID"] => 0
_SERVER["LESSOPEN"] => ||/usr/bin/lesspipe.sh %s
_SERVER["DISPLAY"] => :10.0
_SERVER["CC"] => /root/pdisk/php-5.6.31/meta_ccld
_SERVER["GTK_IM_MODULE"] => gtk-im-context-simple
_SERVER["G_BROKEN_FILENAMES"] => 1
_SERVER["COLORTERM"] => gnome-terminal
_SERVER["_"] => /root/pdisk/php-5.6.31/sapi/cli/php
_SERVER["PHP_SELF"] => 
_SERVER["SCRIPT_NAME"] => 
_SERVER["SCRIPT_FILENAME"] => 
_SERVER["PATH_TRANSLATED"] => 
_SERVER["DOCUMENT_ROOT"] => 
_SERVER["REQUEST_TIME_FLOAT"] => 1505352328.5343
_SERVER["REQUEST_TIME"] => 1505352328
_SERVER["argv"] => Array
(
)

_SERVER["argc"] => 0
_ENV["ORBIT_SOCKETDIR"] => /tmp/orbit-root
_ENV["SSH_AGENT_PID"] => 2160
_ENV["TEST_PHP_SRCDIR"] => /root/pdisk/php-5.6.31
_ENV["GIO_LAUNCHED_DESKTOP_FILE_PID"] => 15486
_ENV["IMSETTINGS_INTEGRATE_DESKTOP"] => yes
_ENV["SHELL"] => /bin/bash
_ENV["TERM"] => xterm
_ENV["XDG_SESSION_COOKIE"] => 4624ca90a9658cc72b88287800000012-1504933326.665770-601106906
_ENV["MAKEFLAGS"] => 
_ENV["SSH_CLIENT"] => deleted
_ENV["GTK_RC_FILES"] => /etc/gtk/gtkrc:/root/.gtkrc-1.2-gnome2
_ENV["WINDOWID"] => 58859573
_ENV["OLDPWD"] => /root/pdisk/php-5.6.31
_ENV["QTDIR"] => /usr/lib64/qt-3.3
_ENV["QTINC"] => /usr/lib64/qt-3.3/include
_ENV["SSH_TTY"] => deleted
_ENV["IMSETTINGS_MODULE"] => none
_ENV["USER"] => root
_ENV["LS_COLORS"] => rs=0:di=01;34:ln=01;36:mh=00:pi=40;33:so=01;35:do=01;35:bd=40;33;01:cd=40;33;01:or=40;31;01:mi=01;05;37;41:su=37;41:sg=30;43:ca=30;41:tw=30;42:ow=34;42:st=37;44:ex=01;32:*.tar=01;31:*.tgz=01;31:*.arj=01;31:*.taz=01;31:*.lzh=01;31:*.lzma=01;31:*.tlz=01;31:*.txz=01;31:*.zip=01;31:*.z=01;31:*.Z=01;31:*.dz=01;31:*.gz=01;31:*.lz=01;31:*.xz=01;31:*.bz2=01;31:*.tbz=01;31:*.tbz2=01;31:*.bz=01;31:*.tz=01;31:*.deb=01;31:*.rpm=01;31:*.jar=01;31:*.rar=01;31:*.ace=01;31:*.zoo=01;31:*.cpio=01;31:*.7z=01;31:*.rz=01;31:*.jpg=01;35:*.jpeg=01;35:*.gif=01;35:*.bmp=01;35:*.pbm=01;35:*.pgm=01;35:*.ppm=01;35:*.tga=01;35:*.xbm=01;35:*.xpm=01;35:*.tif=01;35:*.tiff=01;35:*.png=01;35:*.svg=01;35:*.svgz=01;35:*.mng=01;35:*.pcx=01;35:*.mov=01;35:*.mpg=01;35:*.mpeg=01;35:*.m2v=01;35:*.mkv=01;35:*.ogm=01;35:*.mp4=01;35:*.m4v=01;35:*.mp4v=01;35:*.vob=01;35:*.qt=01;35:*.nuv=01;35:*.wmv=01;35:*.asf=01;35:*.rm=01;35:*.rmvb=01;35:*.flc=01;35:*.avi=01;35:*.fli=01;35:*.flv=01;35:*.gl=01;35:*.dl=01;35:*.xcf=01;35:*.xwd=01;35:*.yuv=01;35:*.cgm=01;35:*.emf=01;35:*.axv=01;35:*.anx=01;35:*.ogv=01;35:*.ogx=01;35:*.aac=01;36:*.au=01;36:*.flac=01;36:*.mid=01;36:*.midi=01;36:*.mka=01;36:*.mp3=01;36:*.mpc=01;36:*.ogg=01;36:*.ra=01;36:*.wav=01;36:*.axa=01;36:*.oga=01;36:*.spx=01;36:*.xspf=01;36:
_ENV["HBASE_HOME"] => /root/pdisk/hbase-1.0.3
_ENV["GNOME_KEYRING_SOCKET"] => /tmp/keyring-gLpnjb/socket
_ENV["SSH_AUTH_SOCK"] => deleted
_ENV["SESSION_MANAGER"] => local/unix:@/tmp/.ICE-unix/2159,unix/unix:/tmp/.ICE-unix/2159
_ENV["MAKELEVEL"] => 1
_ENV["GIO_LAUNCHED_DESKTOP_FILE"] => /root/Desktop/gnome-terminal.desktop
_ENV["MFLAGS"] => 
_ENV["PATH"] => /usr/lib64/qt-3.3/bin:/root/pdisk/jdk1.7.0_80/bin:/root/pdisk/hbase-1.0.3/bin:/bin:/usr/bin:/usr/X11R6/bin:/usr/local/bin:/sbin:/usr/sbin:/root/pdisk
_ENV["QT_IM_MODULE"] => xim
_ENV["PWD"] => /root/pdisk/php-5.6.31
_ENV["XMODIFIERS"] => @im=none
_ENV["JAVA_HOME"] => /root/pdisk/jdk1.7.0_80
_ENV["LANG"] => en_US.UTF-8
_ENV["TEST_PHP_EXECUTABLE"] => /root/pdisk/php-5.6.31/sapi/cli/php
_ENV["SSH_ASKPASS"] => /usr/libexec/openssh/gnome-ssh-askpass
_ENV["HOME"] => /root
_ENV["SHLVL"] => 3
_ENV["GNOME_DESKTOP_SESSION_ID"] => this-is-deprecated
_ENV["QTLIB"] => /usr/lib64/qt-3.3/lib
_ENV["CVS_RSH"] => ssh
_ENV["SSH_CONNECTION"] => deleted
_ENV["DBUS_SESSION_BUS_ADDRESS"] => unix:abstract=/tmp/dbus-oh9E5u1JEW,guid=562bb4244c101a47a4a447ed000000d1
_ENV["CLASSPATH"] => .:/root/pdisk/jdk1.7.0_80/lib/dt.jar:/root/pdisk/jdk1.7.0_80/lib/tools.jar
_ENV["UID"] => 0
_ENV["LESSOPEN"] => ||/usr/bin/lesspipe.sh %s
_ENV["DISPLAY"] => :10.0
_ENV["CC"] => /root/pdisk/php-5.6.31/meta_ccld
_ENV["GTK_IM_MODULE"] => gtk-im-context-simple
_ENV["G_BROKEN_FILENAMES"] => 1
_ENV["COLORTERM"] => gnome-terminal
_ENV["_"] => /root/pdisk/php-5.6.31/sapi/cli/php

PHP License
This program is free software; you can redistribute it and/or modify
it under the terms of the PHP License as published by the PHP Group
and included in the distribution in the file:  LICENSE

This program is distributed in the hope that it will be useful,
but WITHOUT ANY WARRANTY; without even the implied warranty of
MERCHANTABILITY or FITNESS FOR A PARTICULAR PURPOSE.

If you did not receive a copy of the PHP license, or have any
questions about PHP licensing, please contact license@php.net.
 
PHP Copyright © 2001-2019 The PHP Group
All rights reserved.
Last updated: Wed Oct 23 03:01:29 2019 UTC