php.net |  support |  documentation |  report a bug |  advanced search |  search howto |  statistics |  random bug |  login
Bug #67703 make failed
Submitted: 2014-07-29 03:11 UTC Modified: 2015-03-03 09:00 UTC
From: 13579443 at qq dot com Assigned: neeke (profile)
Status: Closed Package: *General Issues
PHP Version: 5.5.15 OS: ceontos
Private report: No CVE-ID: None
 [2014-07-29 03:11 UTC] 13579443 at qq dot com
Description:
------------
/bin/sh /data/chaolin/SeasLog-1.0.0/SeasLog/libtool --mode=compile cc  -I. -I/data/chaolin/SeasLog-1.0.0/SeasLog -DPHP_ATOM_INC -I/data/chaolin/SeasLog-1.0.0/SeasLog/include -I/data/chaolin/SeasLog-1.0.0/SeasLog/main -I/data/chaolin/SeasLog-1.0.0/SeasLog -I/usr/local/php5/include/php -I/usr/local/php5/include/php/main -I/usr/local/php5/include/php/TSRM -I/usr/local/php5/include/php/Zend -I/usr/local/php5/include/php/ext -I/usr/local/php5/include/php/ext/date/lib  -DHAVE_CONFIG_H  -g -O2   -c /data/chaolin/SeasLog-1.0.0/SeasLog/seaslog.c -o seaslog.lo 
mkdir .libs
 cc -I. -I/data/chaolin/SeasLog-1.0.0/SeasLog -DPHP_ATOM_INC -I/data/chaolin/SeasLog-1.0.0/SeasLog/include -I/data/chaolin/SeasLog-1.0.0/SeasLog/main -I/data/chaolin/SeasLog-1.0.0/SeasLog -I/usr/local/php5/include/php -I/usr/local/php5/include/php/main -I/usr/local/php5/include/php/TSRM -I/usr/local/php5/include/php/Zend -I/usr/local/php5/include/php/ext -I/usr/local/php5/include/php/ext/date/lib -DHAVE_CONFIG_H -g -O2 -c /data/chaolin/SeasLog-1.0.0/SeasLog/seaslog.c  -fPIC -DPIC -o .libs/seaslog.o
/data/chaolin/SeasLog-1.0.0/SeasLog/seaslog.c: In function 鈥榸m_startup_seaslog鈥

                                                                                   /data/chaolin/SeasLog-1.0.0/SeasLog/seaslog.c:151:67: error: expected expression before 鈥榲oid鈥
/data/chaolin/SeasLog-1.0.0/SeasLog/seaslog.c: In function 鈥榬eal_php_log_ex鈥

                         /data/chaolin/SeasLog-1.0.0/SeasLog/seaslog.c:242:14: error: 鈥榯srm_ls鈥undeclared (first use in this function)
/data/chaolin/SeasLog-1.0.0/SeasLog/seaslog.c:242:14: note: each undeclared identifier is reported only once for each function it appears in
/data/chaolin/SeasLog-1.0.0/SeasLog/seaslog.c: In function 鈥榤k_real_date鈥

                                                                             /data/chaolin/SeasLog-1.0.0/SeasLog/seaslog.c:363:9: error: too few arguments to function 鈥榩hp_format_date鈥
/usr/local/php5/include/php/ext/date/php_date.h:188:14: note: declared here
/data/chaolin/SeasLog-1.0.0/SeasLog/seaslog.c:365:9: error: too few arguments to function 鈥榩hp_format_date鈥
/usr/local/php5/include/php/ext/date/php_date.h:188:14: note: declared here
/data/chaolin/SeasLog-1.0.0/SeasLog/seaslog.c: In function 鈥榸im_SEASLOG_RES_NAME_analyzerCount鈥

                                                                                                   /data/chaolin/SeasLog-1.0.0/SeasLog/seaslog.c:573:9: error: too few arguments to function 鈥榞et_type_count鈥
/data/chaolin/SeasLog-1.0.0/SeasLog/seaslog.c:371:13: note: declared here
/data/chaolin/SeasLog-1.0.0/SeasLog/seaslog.c:574:9: error: too few arguments to function 鈥榞et_type_count鈥
/data/chaolin/SeasLog-1.0.0/SeasLog/seaslog.c:371:13: note: declared here
/data/chaolin/SeasLog-1.0.0/SeasLog/seaslog.c:575:9: error: too few arguments to function 鈥榞et_type_count鈥
/data/chaolin/SeasLog-1.0.0/SeasLog/seaslog.c:371:13: note: declared here
/data/chaolin/SeasLog-1.0.0/SeasLog/seaslog.c:576:9: error: too few arguments to function 鈥榞et_type_count鈥
/data/chaolin/SeasLog-1.0.0/SeasLog/seaslog.c:371:13: note: declared here
/data/chaolin/SeasLog-1.0.0/SeasLog/seaslog.c:577:9: error: too few arguments to function 鈥榞et_type_count鈥
/data/chaolin/SeasLog-1.0.0/SeasLog/seaslog.c:371:13: note: declared here
/data/chaolin/SeasLog-1.0.0/SeasLog/seaslog.c:578:9: error: too few arguments to function 鈥榞et_type_count鈥
/data/chaolin/SeasLog-1.0.0/SeasLog/seaslog.c:371:13: note: declared here
/data/chaolin/SeasLog-1.0.0/SeasLog/seaslog.c:579:9: error: too few arguments to function 鈥榞et_type_count鈥
/data/chaolin/SeasLog-1.0.0/SeasLog/seaslog.c:371:13: note: declared here
/data/chaolin/SeasLog-1.0.0/SeasLog/seaslog.c:580:9: error: too few arguments to function 鈥榞et_type_count鈥
/data/chaolin/SeasLog-1.0.0/SeasLog/seaslog.c:371:13: note: declared here
/data/chaolin/SeasLog-1.0.0/SeasLog/seaslog.c:592:9: error: too few arguments to function 鈥榞et_type_count鈥
/data/chaolin/SeasLog-1.0.0/SeasLog/seaslog.c:371:13: note: declared here
/data/chaolin/SeasLog-1.0.0/SeasLog/seaslog.c:596:9: error: too few arguments to function 鈥榞et_type_count鈥
/data/chaolin/SeasLog-1.0.0/SeasLog/seaslog.c:371:13: note: declared here
/data/chaolin/SeasLog-1.0.0/SeasLog/seaslog.c: In function 鈥榑seaslog_log鈥

                                                                             /data/chaolin/SeasLog-1.0.0/SeasLog/seaslog.c:829:5: error: too few arguments to function 鈥榤k_real_date鈥
/data/chaolin/SeasLog-1.0.0/SeasLog/seaslog.c:360:14: note: declared here
/data/chaolin/SeasLog-1.0.0/SeasLog/seaslog.c:831:5: error: too few arguments to function 鈥榩hp_format_date鈥
/usr/local/php5/include/php/ext/date/php_date.h:188:14: note: declared here
/data/chaolin/SeasLog-1.0.0/SeasLog/seaslog.c: In function 鈥榑mk_log_dir鈥

                                                                            /data/chaolin/SeasLog-1.0.0/SeasLog/seaslog.c:854:19: error: 鈥榯srm_ls鈥undeclared (first use in this function)
/data/chaolin/SeasLog-1.0.0/SeasLog/seaslog.c: In function 鈥榑ck_log_dir鈥

                                                                            /data/chaolin/SeasLog-1.0.0/SeasLog/seaslog.c:880:30: error: 鈥榯srm_ls鈥undeclared (first use in this function)
/data/chaolin/SeasLog-1.0.0/SeasLog/seaslog.c:880:5: error: too few arguments to function 鈥榗all_user_function_ex鈥
/usr/local/php5/include/php/Zend/zend_API.h:451:14: note: declared here
make: *** [seaslog.lo] Error 1


Patches

Pull Requests

History

AllCommentsChangesGit/SVN commitsRelated reports
 [2015-03-03 09:00 UTC] neeke@php.net
-Status: Open +Status: Closed -Assigned To: +Assigned To: neeke
 [2015-03-03 09:00 UTC] neeke@php.net
Thank you for your bug report. This issue has already been fixed
in the latest released version of PHP, which you can download at 
http://www.php.net/downloads.php

This bug has been fixed.
 
PHP Copyright © 2001-2026 The PHP Group
All rights reserved.
Last updated: Tue Oct 06 03:00:02 2026 UTC