php.net |  support |  documentation |  report a bug |  advanced search |  search howto |  statistics |  random bug |  login
Bug #64000 Compile failure on modern PHP versions
Submitted: 2013-01-16 01:25 UTC Modified: 2013-01-24 13:13 UTC
Votes:1
Avg. Score:5.0 ± 0.0
Reproduced:1 of 1 (100.0%)
Same Version:0 (0.0%)
Same OS:1 (100.0%)
From: spam2 at rhsoft dot net Assigned:
Status: Wont fix Package: id3 (PECL)
PHP Version: 5.4.10 OS: Linux
Private report: No CVE-ID: None
Have you experienced this issue?
Rate the importance of this bug to you:

 [2013-01-16 01:25 UTC] spam2 at rhsoft dot net
Description:
------------
this extension was not updated over many years and at least with recent operating systems / php v ersions it does no longer compile :-(

/bin/sh /home/builduser/rpmbuild/BUILD/php-pecl-id3-0.2/id3-0.2/libtool --mode=compile x86_64-redhat-linux-gcc  -I. -I/home/builduser/rpmbuild/BUILD/php-pecl-id3-0.2/id3-0.2 -DPHP_ATOM_INC -I/home/builduser/rpmbuild/BUILD/php-pecl-id3-0.2/id3-0.2/include -I/home/builduser/rpmbuild/BUILD/php-pecl-id3-0.2/id3-0.2/main -I/home/builduser/rpmbuild/BUILD/php-pecl-id3-0.2/id3-0.2 -I/usr/include/php -I/usr/include/php/main -I/usr/include/php/TSRM -I/usr/include/php/Zend -I/usr/include/php/ext -I/usr/include/php/ext/date/lib  -DHAVE_CONFIG_H  -O3 -march=corei7 -mtune=corei7 -mmmx -msse2 -msse3 -msse4.1 -msse4.2 -maes -fopenmp -mfpmath=sse -pipe -fstack-protector --param=ssp-buffer-size=4 -mfpmath=sse -D_FORTIFY_SOURCE=2 -fexceptions   -c /home/builduser/rpmbuild/BUILD/php-pecl-id3-0.2/id3-0.2/id3.c -o id3.lo 
libtool: compile:  x86_64-redhat-linux-gcc -I. -I/home/builduser/rpmbuild/BUILD/php-pecl-id3-0.2/id3-0.2 -DPHP_ATOM_INC -I/home/builduser/rpmbuild/BUILD/php-pecl-id3-0.2/id3-0.2/include -I/home/builduser/rpmbuild/BUILD/php-pecl-id3-0.2/id3-0.2/main -I/home/builduser/rpmbuild/BUILD/php-pecl-id3-0.2/id3-0.2 -I/usr/include/php -I/usr/include/php/main -I/usr/include/php/TSRM -I/usr/include/php/Zend -I/usr/include/php/ext -I/usr/include/php/ext/date/lib -DHAVE_CONFIG_H -O3 -march=corei7 -mtune=corei7 -mmmx -msse2 -msse3 -msse4.1 -msse4.2 -maes -fopenmp -mfpmath=sse -pipe -fstack-protector --param=ssp-buffer-size=4 -mfpmath=sse -D_FORTIFY_SOURCE=2 -fexceptions -c /home/builduser/rpmbuild/BUILD/php-pecl-id3-0.2/id3-0.2/id3.c  -fPIC -DPIC -o .libs/id3.o
/home/builduser/rpmbuild/BUILD/php-pecl-id3-0.2/id3-0.2/id3.c:196:1: error: unknown type name 'function_entry'
/home/builduser/rpmbuild/BUILD/php-pecl-id3-0.2/id3-0.2/id3.c:197:2: warning: braces around scalar initializer [enabled by default]
/home/builduser/rpmbuild/BUILD/php-pecl-id3-0.2/id3-0.2/id3.c:197:2: warning: (near initialization for 'id3_functions[0]') [enabled by default]
/home/builduser/rpmbuild/BUILD/php-pecl-id3-0.2/id3-0.2/id3.c:197:2: warning: initialization makes integer from pointer without a cast [enabled by default]
/home/builduser/rpmbuild/BUILD/php-pecl-id3-0.2/id3-0.2/id3.c:197:2: warning: (near initialization for 'id3_functions[0]') [enabled by default]
/home/builduser/rpmbuild/BUILD/php-pecl-id3-0.2/id3-0.2/id3.c:197:2: error: initializer element is not computable at load time
/home/builduser/rpmbuild/BUILD/php-pecl-id3-0.2/id3-0.2/id3.c:197:2: error: (near initialization for 'id3_functions[0]')
/home/builduser/rpmbuild/BUILD/php-pecl-id3-0.2/id3-0.2/id3.c:197:2: warning: excess elements in scalar initializer [enabled by default]
/home/builduser/rpmbuild/BUILD/php-pecl-id3-0.2/id3-0.2/id3.c:197:2: warning: (near initialization for 'id3_functions[0]') [enabled by default]
/home/builduser/rpmbuild/BUILD/php-pecl-id3-0.2/id3-0.2/id3.c:197:2: warning: excess elements in scalar initializer [enabled by default]
/home/builduser/rpmbuild/BUILD/php-pecl-id3-0.2/id3-0.2/id3.c:197:2: warning: (near initialization for 'id3_functions[0]') [enabled by default]
/home/builduser/rpmbuild/BUILD/php-pecl-id3-0.2/id3-0.2/id3.c:197:2: warning: excess elements in scalar initializer [enabled by default]
/home/builduser/rpmbuild/BUILD/php-pecl-id3-0.2/id3-0.2/id3.c:197:2: warning: (near initialization for 'id3_functions[0]') [enabled by default]
/home/builduser/rpmbuild/BUILD/php-pecl-id3-0.2/id3-0.2/id3.c:197:2: warning: excess elements in scalar initializer [enabled by default]
/home/builduser/rpmbuild/BUILD/php-pecl-id3-0.2/id3-0.2/id3.c:197:2: warning: (near initialization for 'id3_functions[0]') [enabled by default]
/home/builduser/rpmbuild/BUILD/php-pecl-id3-0.2/id3-0.2/id3.c:198:2: warning: braces around scalar initializer [enabled by default]
/home/builduser/rpmbuild/BUILD/php-pecl-id3-0.2/id3-0.2/id3.c:198:2: warning: (near initialization for 'id3_functions[1]') [enabled by default]
/home/builduser/rpmbuild/BUILD/php-pecl-id3-0.2/id3-0.2/id3.c:198:2: warning: initialization makes integer from pointer without a cast [enabled by default]
/home/builduser/rpmbuild/BUILD/php-pecl-id3-0.2/id3-0.2/id3.c:198:2: warning: (near initialization for 'id3_functions[1]') [enabled by default]
/home/builduser/rpmbuild/BUILD/php-pecl-id3-0.2/id3-0.2/id3.c:198:2: error: initializer element is not computable at load time
/home/builduser/rpmbuild/BUILD/php-pecl-id3-0.2/id3-0.2/id3.c:198:2: error: (near initialization for 'id3_functions[1]')
/home/builduser/rpmbuild/BUILD/php-pecl-id3-0.2/id3-0.2/id3.c:198:2: warning: excess elements in scalar initializer [enabled by default]
/home/builduser/rpmbuild/BUILD/php-pecl-id3-0.2/id3-0.2/id3.c:198:2: warning: (near initialization for 'id3_functions[1]') [enabled by default]
/home/builduser/rpmbuild/BUILD/php-pecl-id3-0.2/id3-0.2/id3.c:198:2: warning: excess elements in scalar initializer [enabled by default]
/home/builduser/rpmbuild/BUILD/php-pecl-id3-0.2/id3-0.2/id3.c:198:2: warning: (near initialization for 'id3_functions[1]') [enabled by default]
/home/builduser/rpmbuild/BUILD/php-pecl-id3-0.2/id3-0.2/id3.c:198:2: warning: excess elements in scalar initializer [enabled by default]
/home/builduser/rpmbuild/BUILD/php-pecl-id3-0.2/id3-0.2/id3.c:198:2: warning: (near initialization for 'id3_functions[1]') [enabled by default]
/home/builduser/rpmbuild/BUILD/php-pecl-id3-0.2/id3-0.2/id3.c:198:2: warning: excess elements in scalar initializer [enabled by default]
/home/builduser/rpmbuild/BUILD/php-pecl-id3-0.2/id3-0.2/id3.c:198:2: warning: (near initialization for 'id3_functions[1]') [enabled by default]
/home/builduser/rpmbuild/BUILD/php-pecl-id3-0.2/id3-0.2/id3.c:199:2: warning: braces around scalar initializer [enabled by default]
/home/builduser/rpmbuild/BUILD/php-pecl-id3-0.2/id3-0.2/id3.c:199:2: warning: (near initialization for 'id3_functions[2]') [enabled by default]
/home/builduser/rpmbuild/BUILD/php-pecl-id3-0.2/id3-0.2/id3.c:199:2: warning: initialization makes integer from pointer without a cast [enabled by default]
/home/builduser/rpmbuild/BUILD/php-pecl-id3-0.2/id3-0.2/id3.c:199:2: warning: (near initialization for 'id3_functions[2]') [enabled by default]
/home/builduser/rpmbuild/BUILD/php-pecl-id3-0.2/id3-0.2/id3.c:199:2: error: initializer element is not computable at load time
/home/builduser/rpmbuild/BUILD/php-pecl-id3-0.2/id3-0.2/id3.c:199:2: error: (near initialization for 'id3_functions[2]')
/home/builduser/rpmbuild/BUILD/php-pecl-id3-0.2/id3-0.2/id3.c:199:2: warning: excess elements in scalar initializer [enabled by default]
/home/builduser/rpmbuild/BUILD/php-pecl-id3-0.2/id3-0.2/id3.c:199:2: warning: (near initialization for 'id3_functions[2]') [enabled by default]
/home/builduser/rpmbuild/BUILD/php-pecl-id3-0.2/id3-0.2/id3.c:199:2: warning: excess elements in scalar initializer [enabled by default]
/home/builduser/rpmbuild/BUILD/php-pecl-id3-0.2/id3-0.2/id3.c:199:2: warning: (near initialization for 'id3_functions[2]') [enabled by default]
/home/builduser/rpmbuild/BUILD/php-pecl-id3-0.2/id3-0.2/id3.c:199:2: warning: excess elements in scalar initializer [enabled by default]
/home/builduser/rpmbuild/BUILD/php-pecl-id3-0.2/id3-0.2/id3.c:199:2: warning: (near initialization for 'id3_functions[2]') [enabled by default]
/home/builduser/rpmbuild/BUILD/php-pecl-id3-0.2/id3-0.2/id3.c:199:2: warning: excess elements in scalar initializer [enabled by default]
/home/builduser/rpmbuild/BUILD/php-pecl-id3-0.2/id3-0.2/id3.c:199:2: warning: (near initialization for 'id3_functions[2]') [enabled by default]
/home/builduser/rpmbuild/BUILD/php-pecl-id3-0.2/id3-0.2/id3.c:200:2: warning: braces around scalar initializer [enabled by default]
/home/builduser/rpmbuild/BUILD/php-pecl-id3-0.2/id3-0.2/id3.c:200:2: warning: (near initialization for 'id3_functions[3]') [enabled by default]
/home/builduser/rpmbuild/BUILD/php-pecl-id3-0.2/id3-0.2/id3.c:200:2: warning: initialization makes integer from pointer without a cast [enabled by default]
/home/builduser/rpmbuild/BUILD/php-pecl-id3-0.2/id3-0.2/id3.c:200:2: warning: (near initialization for 'id3_functions[3]') [enabled by default]
/home/builduser/rpmbuild/BUILD/php-pecl-id3-0.2/id3-0.2/id3.c:200:2: error: initializer element is not computable at load time
/home/builduser/rpmbuild/BUILD/php-pecl-id3-0.2/id3-0.2/id3.c:200:2: error: (near initialization for 'id3_functions[3]')
/home/builduser/rpmbuild/BUILD/php-pecl-id3-0.2/id3-0.2/id3.c:200:2: warning: excess elements in scalar initializer [enabled by default]
/home/builduser/rpmbuild/BUILD/php-pecl-id3-0.2/id3-0.2/id3.c:200:2: warning: (near initialization for 'id3_functions[3]') [enabled by default]
/home/builduser/rpmbuild/BUILD/php-pecl-id3-0.2/id3-0.2/id3.c:200:2: warning: excess elements in scalar initializer [enabled by default]
/home/builduser/rpmbuild/BUILD/php-pecl-id3-0.2/id3-0.2/id3.c:200:2: warning: (near initialization for 'id3_functions[3]') [enabled by default]
/home/builduser/rpmbuild/BUILD/php-pecl-id3-0.2/id3-0.2/id3.c:200:2: warning: excess elements in scalar initializer [enabled by default]
/home/builduser/rpmbuild/BUILD/php-pecl-id3-0.2/id3-0.2/id3.c:200:2: warning: (near initialization for 'id3_functions[3]') [enabled by default]
/home/builduser/rpmbuild/BUILD/php-pecl-id3-0.2/id3-0.2/id3.c:200:2: warning: excess elements in scalar initializer [enabled by default]
/home/builduser/rpmbuild/BUILD/php-pecl-id3-0.2/id3-0.2/id3.c:200:2: warning: (near initialization for 'id3_functions[3]') [enabled by default]
/home/builduser/rpmbuild/BUILD/php-pecl-id3-0.2/id3-0.2/id3.c:201:2: warning: braces around scalar initializer [enabled by default]
/home/builduser/rpmbuild/BUILD/php-pecl-id3-0.2/id3-0.2/id3.c:201:2: warning: (near initialization for 'id3_functions[4]') [enabled by default]
/home/builduser/rpmbuild/BUILD/php-pecl-id3-0.2/id3-0.2/id3.c:201:2: warning: initialization makes integer from pointer without a cast [enabled by default]
/home/builduser/rpmbuild/BUILD/php-pecl-id3-0.2/id3-0.2/id3.c:201:2: warning: (near initialization for 'id3_functions[4]') [enabled by default]
/home/builduser/rpmbuild/BUILD/php-pecl-id3-0.2/id3-0.2/id3.c:201:2: error: initializer element is not computable at load time
/home/builduser/rpmbuild/BUILD/php-pecl-id3-0.2/id3-0.2/id3.c:201:2: error: (near initialization for 'id3_functions[4]')
/home/builduser/rpmbuild/BUILD/php-pecl-id3-0.2/id3-0.2/id3.c:201:2: warning: excess elements in scalar initializer [enabled by default]
/home/builduser/rpmbuild/BUILD/php-pecl-id3-0.2/id3-0.2/id3.c:201:2: warning: (near initialization for 'id3_functions[4]') [enabled by default]
/home/builduser/rpmbuild/BUILD/php-pecl-id3-0.2/id3-0.2/id3.c:201:2: warning: excess elements in scalar initializer [enabled by default]
/home/builduser/rpmbuild/BUILD/php-pecl-id3-0.2/id3-0.2/id3.c:201:2: warning: (near initialization for 'id3_functions[4]') [enabled by default]
/home/builduser/rpmbuild/BUILD/php-pecl-id3-0.2/id3-0.2/id3.c:201:2: warning: excess elements in scalar initializer [enabled by default]
/home/builduser/rpmbuild/BUILD/php-pecl-id3-0.2/id3-0.2/id3.c:201:2: warning: (near initialization for 'id3_functions[4]') [enabled by default]
/home/builduser/rpmbuild/BUILD/php-pecl-id3-0.2/id3-0.2/id3.c:201:2: warning: excess elements in scalar initializer [enabled by default]
/home/builduser/rpmbuild/BUILD/php-pecl-id3-0.2/id3-0.2/id3.c:201:2: warning: (near initialization for 'id3_functions[4]') [enabled by default]
/home/builduser/rpmbuild/BUILD/php-pecl-id3-0.2/id3-0.2/id3.c:202:2: warning: braces around scalar initializer [enabled by default]
/home/builduser/rpmbuild/BUILD/php-pecl-id3-0.2/id3-0.2/id3.c:202:2: warning: (near initialization for 'id3_functions[5]') [enabled by default]
/home/builduser/rpmbuild/BUILD/php-pecl-id3-0.2/id3-0.2/id3.c:202:2: warning: initialization makes integer from pointer without a cast [enabled by default]
/home/builduser/rpmbuild/BUILD/php-pecl-id3-0.2/id3-0.2/id3.c:202:2: warning: (near initialization for 'id3_functions[5]') [enabled by default]
/home/builduser/rpmbuild/BUILD/php-pecl-id3-0.2/id3-0.2/id3.c:202:2: error: initializer element is not computable at load time
/home/builduser/rpmbuild/BUILD/php-pecl-id3-0.2/id3-0.2/id3.c:202:2: error: (near initialization for 'id3_functions[5]')
/home/builduser/rpmbuild/BUILD/php-pecl-id3-0.2/id3-0.2/id3.c:202:2: warning: excess elements in scalar initializer [enabled by default]
/home/builduser/rpmbuild/BUILD/php-pecl-id3-0.2/id3-0.2/id3.c:202:2: warning: (near initialization for 'id3_functions[5]') [enabled by default]
/home/builduser/rpmbuild/BUILD/php-pecl-id3-0.2/id3-0.2/id3.c:202:2: warning: excess elements in scalar initializer [enabled by default]
/home/builduser/rpmbuild/BUILD/php-pecl-id3-0.2/id3-0.2/id3.c:202:2: warning: (near initialization for 'id3_functions[5]') [enabled by default]
/home/builduser/rpmbuild/BUILD/php-pecl-id3-0.2/id3-0.2/id3.c:202:2: warning: excess elements in scalar initializer [enabled by default]
/home/builduser/rpmbuild/BUILD/php-pecl-id3-0.2/id3-0.2/id3.c:202:2: warning: (near initialization for 'id3_functions[5]') [enabled by default]
/home/builduser/rpmbuild/BUILD/php-pecl-id3-0.2/id3-0.2/id3.c:202:2: warning: excess elements in scalar initializer [enabled by default]
/home/builduser/rpmbuild/BUILD/php-pecl-id3-0.2/id3-0.2/id3.c:202:2: warning: (near initialization for 'id3_functions[5]') [enabled by default]
/home/builduser/rpmbuild/BUILD/php-pecl-id3-0.2/id3-0.2/id3.c:203:2: warning: braces around scalar initializer [enabled by default]
/home/builduser/rpmbuild/BUILD/php-pecl-id3-0.2/id3-0.2/id3.c:203:2: warning: (near initialization for 'id3_functions[6]') [enabled by default]
/home/builduser/rpmbuild/BUILD/php-pecl-id3-0.2/id3-0.2/id3.c:203:2: warning: initialization makes integer from pointer without a cast [enabled by default]
/home/builduser/rpmbuild/BUILD/php-pecl-id3-0.2/id3-0.2/id3.c:203:2: warning: (near initialization for 'id3_functions[6]') [enabled by default]
/home/builduser/rpmbuild/BUILD/php-pecl-id3-0.2/id3-0.2/id3.c:203:2: error: initializer element is not computable at load time
/home/builduser/rpmbuild/BUILD/php-pecl-id3-0.2/id3-0.2/id3.c:203:2: error: (near initialization for 'id3_functions[6]')
/home/builduser/rpmbuild/BUILD/php-pecl-id3-0.2/id3-0.2/id3.c:203:2: warning: excess elements in scalar initializer [enabled by default]
/home/builduser/rpmbuild/BUILD/php-pecl-id3-0.2/id3-0.2/id3.c:203:2: warning: (near initialization for 'id3_functions[6]') [enabled by default]
/home/builduser/rpmbuild/BUILD/php-pecl-id3-0.2/id3-0.2/id3.c:203:2: warning: excess elements in scalar initializer [enabled by default]
/home/builduser/rpmbuild/BUILD/php-pecl-id3-0.2/id3-0.2/id3.c:203:2: warning: (near initialization for 'id3_functions[6]') [enabled by default]
/home/builduser/rpmbuild/BUILD/php-pecl-id3-0.2/id3-0.2/id3.c:203:2: warning: excess elements in scalar initializer [enabled by default]
/home/builduser/rpmbuild/BUILD/php-pecl-id3-0.2/id3-0.2/id3.c:203:2: warning: (near initialization for 'id3_functions[6]') [enabled by default]
/home/builduser/rpmbuild/BUILD/php-pecl-id3-0.2/id3-0.2/id3.c:203:2: warning: excess elements in scalar initializer [enabled by default]
/home/builduser/rpmbuild/BUILD/php-pecl-id3-0.2/id3-0.2/id3.c:203:2: warning: (near initialization for 'id3_functions[6]') [enabled by default]
/home/builduser/rpmbuild/BUILD/php-pecl-id3-0.2/id3-0.2/id3.c:204:2: warning: braces around scalar initializer [enabled by default]
/home/builduser/rpmbuild/BUILD/php-pecl-id3-0.2/id3-0.2/id3.c:204:2: warning: (near initialization for 'id3_functions[7]') [enabled by default]
/home/builduser/rpmbuild/BUILD/php-pecl-id3-0.2/id3-0.2/id3.c:204:2: warning: initialization makes integer from pointer without a cast [enabled by default]
/home/builduser/rpmbuild/BUILD/php-pecl-id3-0.2/id3-0.2/id3.c:204:2: warning: (near initialization for 'id3_functions[7]') [enabled by default]
/home/builduser/rpmbuild/BUILD/php-pecl-id3-0.2/id3-0.2/id3.c:204:2: error: initializer element is not computable at load time
/home/builduser/rpmbuild/BUILD/php-pecl-id3-0.2/id3-0.2/id3.c:204:2: error: (near initialization for 'id3_functions[7]')
/home/builduser/rpmbuild/BUILD/php-pecl-id3-0.2/id3-0.2/id3.c:204:2: warning: excess elements in scalar initializer [enabled by default]
/home/builduser/rpmbuild/BUILD/php-pecl-id3-0.2/id3-0.2/id3.c:204:2: warning: (near initialization for 'id3_functions[7]') [enabled by default]
/home/builduser/rpmbuild/BUILD/php-pecl-id3-0.2/id3-0.2/id3.c:204:2: warning: excess elements in scalar initializer [enabled by default]
/home/builduser/rpmbuild/BUILD/php-pecl-id3-0.2/id3-0.2/id3.c:204:2: warning: (near initialization for 'id3_functions[7]') [enabled by default]
/home/builduser/rpmbuild/BUILD/php-pecl-id3-0.2/id3-0.2/id3.c:204:2: warning: excess elements in scalar initializer [enabled by default]
/home/builduser/rpmbuild/BUILD/php-pecl-id3-0.2/id3-0.2/id3.c:204:2: warning: (near initialization for 'id3_functions[7]') [enabled by default]
/home/builduser/rpmbuild/BUILD/php-pecl-id3-0.2/id3-0.2/id3.c:204:2: warning: excess elements in scalar initializer [enabled by default]
/home/builduser/rpmbuild/BUILD/php-pecl-id3-0.2/id3-0.2/id3.c:204:2: warning: (near initialization for 'id3_functions[7]') [enabled by default]
/home/builduser/rpmbuild/BUILD/php-pecl-id3-0.2/id3-0.2/id3.c:205:2: warning: braces around scalar initializer [enabled by default]
/home/builduser/rpmbuild/BUILD/php-pecl-id3-0.2/id3-0.2/id3.c:205:2: warning: (near initialization for 'id3_functions[8]') [enabled by default]
/home/builduser/rpmbuild/BUILD/php-pecl-id3-0.2/id3-0.2/id3.c:205:2: warning: initialization makes integer from pointer without a cast [enabled by default]
/home/builduser/rpmbuild/BUILD/php-pecl-id3-0.2/id3-0.2/id3.c:205:2: warning: (near initialization for 'id3_functions[8]') [enabled by default]
/home/builduser/rpmbuild/BUILD/php-pecl-id3-0.2/id3-0.2/id3.c:205:2: error: initializer element is not computable at load time
/home/builduser/rpmbuild/BUILD/php-pecl-id3-0.2/id3-0.2/id3.c:205:2: error: (near initialization for 'id3_functions[8]')
/home/builduser/rpmbuild/BUILD/php-pecl-id3-0.2/id3-0.2/id3.c:205:2: warning: excess elements in scalar initializer [enabled by default]
/home/builduser/rpmbuild/BUILD/php-pecl-id3-0.2/id3-0.2/id3.c:205:2: warning: (near initialization for 'id3_functions[8]') [enabled by default]
/home/builduser/rpmbuild/BUILD/php-pecl-id3-0.2/id3-0.2/id3.c:205:2: warning: excess elements in scalar initializer [enabled by default]
/home/builduser/rpmbuild/BUILD/php-pecl-id3-0.2/id3-0.2/id3.c:205:2: warning: (near initialization for 'id3_functions[8]') [enabled by default]
/home/builduser/rpmbuild/BUILD/php-pecl-id3-0.2/id3-0.2/id3.c:205:2: warning: excess elements in scalar initializer [enabled by default]
/home/builduser/rpmbuild/BUILD/php-pecl-id3-0.2/id3-0.2/id3.c:205:2: warning: (near initialization for 'id3_functions[8]') [enabled by default]
/home/builduser/rpmbuild/BUILD/php-pecl-id3-0.2/id3-0.2/id3.c:205:2: warning: excess elements in scalar initializer [enabled by default]
/home/builduser/rpmbuild/BUILD/php-pecl-id3-0.2/id3-0.2/id3.c:205:2: warning: (near initialization for 'id3_functions[8]') [enabled by default]
/home/builduser/rpmbuild/BUILD/php-pecl-id3-0.2/id3-0.2/id3.c:206:2: warning: braces around scalar initializer [enabled by default]
/home/builduser/rpmbuild/BUILD/php-pecl-id3-0.2/id3-0.2/id3.c:206:2: warning: (near initialization for 'id3_functions[9]') [enabled by default]
/home/builduser/rpmbuild/BUILD/php-pecl-id3-0.2/id3-0.2/id3.c:206:2: warning: initialization makes integer from pointer without a cast [enabled by default]
/home/builduser/rpmbuild/BUILD/php-pecl-id3-0.2/id3-0.2/id3.c:206:2: warning: (near initialization for 'id3_functions[9]') [enabled by default]
/home/builduser/rpmbuild/BUILD/php-pecl-id3-0.2/id3-0.2/id3.c:206:2: warning: excess elements in scalar initializer [enabled by default]
/home/builduser/rpmbuild/BUILD/php-pecl-id3-0.2/id3-0.2/id3.c:206:2: warning: (near initialization for 'id3_functions[9]') [enabled by default]
/home/builduser/rpmbuild/BUILD/php-pecl-id3-0.2/id3-0.2/id3.c:206:2: warning: excess elements in scalar initializer [enabled by default]
/home/builduser/rpmbuild/BUILD/php-pecl-id3-0.2/id3-0.2/id3.c:206:2: warning: (near initialization for 'id3_functions[9]') [enabled by default]
/home/builduser/rpmbuild/BUILD/php-pecl-id3-0.2/id3-0.2/id3.c:217:2: warning: initialization from incompatible pointer type [enabled by default]
/home/builduser/rpmbuild/BUILD/php-pecl-id3-0.2/id3-0.2/id3.c:217:2: warning: (near initialization for 'id3_module_entry.functions') [enabled by default]
make: *** [id3.lo] Error 1
error: Bad exit status from /var/tmp/rpm-tmp.1YiCfh (%build)


RPM build errors:
    Bad exit status from /var/tmp/rpm-tmp.1YiCfh (%build)



Patches

id3-build-patch (last revision 2013-01-24 13:11 UTC by krakjoe@php.net)

Add a Patch

Pull Requests

Add a Pull Request

History

AllCommentsChangesGit/SVN commitsRelated reports
 [2013-01-16 02:03 UTC] aharvey@php.net
-Summary: PLEASE can someone update this +Summary: Compile failure on modern PHP versions -Package: Compile Failure +Package: id3
 [2013-01-24 13:11 UTC] krakjoe@php.net
The following patch has been added/updated:

Patch Name: id3-build-patch
Revision:   1359033090
URL:        https://bugs.php.net/patch-display.php?bug=64000&patch=id3-build-patch&revision=1359033090
 [2013-01-24 13:13 UTC] krakjoe@php.net
-Status: Open +Status: Wont fix
 [2013-01-24 13:13 UTC] krakjoe@php.net
For all intents and purposes this extension has been abandoned, for many years, 
by it's author.

I have supplied a simple patch to fix the build and have verified that the patch 
works as intended, however, I lack the knowledge to verify the extensions 
functionality will still work as expected, it could be buggy and may not work at 
all.

This is about as much as any of us can do without a current package maintainer 
coming forward, regrettably I must close the bug with won't fix.
 [2013-01-24 13:21 UTC] spam2 at rhsoft dot net
so why are pecl-extensions are not verified due major upgrades and AT LEAST well visible hints placed there to see that nobody cares?

date of the last update is no hint because there may be no change needed

the current state of PECL is VERY DANGEROUS AT ALL because nobody knows if someone cares about security fixes, memory leaks or whatever and using ANY pecl extension is nothing else than russian roulette
 
PHP Copyright © 2001-2019 The PHP Group
All rights reserved.
Last updated: Thu Mar 21 05:01:26 2019 UTC