|  support |  documentation |  report a bug |  advanced search |  search howto |  statistics |  random bug |  login
Bug #61365 stem compile error on PHP 5.4.0
Submitted: 2012-03-12 21:52 UTC Modified: 2012-03-25 15:14 UTC
Avg. Score:4.0 ± 1.0
Reproduced:2 of 2 (100.0%)
Same Version:2 (100.0%)
Same OS:1 (50.0%)
From: idexter dot ru at gmail dot com Assigned:
Status: Not a bug Package: stem (PECL)
PHP Version: 5.4.0 OS: MacOSX 10.7.3
Private report: No CVE-ID: None
View Add Comment Developer Edit
Welcome! If you don't have a Git account, you can't do anything here.
You can add a comment by following this link or if you reported this bug, you can edit this bug over here.
Block user comment
Status: Assign to:
Bug Type:
From: idexter dot ru at gmail dot com
New email:
PHP Version: OS:


 [2012-03-12 21:52 UTC] idexter dot ru at gmail dot com
A stem does not compile on PHP 5.4.0.
To fix this problem replace "function_entry" to "zend_function_entry"
in file "stem.c" at line #23.

Actual result:
When I try to "make" it. I have some error like this:

/Users/dexter/Sources/stem-1.5.0/stem-1.5.0/stem.c:23: error: expected ‘=’, ‘,’, ‘;’, ‘asm’ or ‘__attribute__’ before ‘stem_functions’
/Users/dexter/Sources/stem-1.5.0/stem-1.5.0/stem.c:101: error: ‘stem_functions’ undeclared here (not in a function)
make: *** [stem.lo] Error 1


right-stem-patch-for-php5.4 (last revision 2012-03-12 21:56 UTC by idexter dot ru at gmail dot com)
stem-patch-for-php5.4 (last revision 2012-03-12 21:53 UTC by idexter dot ru at gmail dot com)

Add a Patch

Pull Requests

Add a Pull Request


AllCommentsChangesGit/SVN commitsRelated reports
 [2012-03-25 15:14 UTC]
It already has been fixed in the SVN. Thanks.
 [2012-03-25 15:14 UTC]
-Status: Open +Status: Not a bug
 [2012-03-25 18:37 UTC]
Version 1.5.1 was packaged with PHP 5.4 fix from SVN.
PHP Copyright © 2001-2021 The PHP Group
All rights reserved.
Last updated: Wed Dec 01 16:03:34 2021 UTC