php.net |  support |  documentation |  report a bug |  advanced search |  search howto |  statistics |  random bug |  login
Bug #61187 Parsekit does not compatible with PHP 5.4.
Submitted: 2012-02-26 16:32 UTC Modified: 2017-04-01 21:16 UTC
Votes:9
Avg. Score:4.9 ± 0.3
Reproduced:9 of 9 (100.0%)
Same Version:7 (77.8%)
Same OS:6 (66.7%)
From: pahan at hubbitus dot info Assigned:
Status: Wont fix Package: parsekit (PECL)
PHP Version: 5.4.0RC8 OS: Linux
Private report: No CVE-ID: None
Have you experienced this issue?
Rate the importance of this bug to you:

 [2012-02-26 16:32 UTC] pahan at hubbitus dot info
Description:
------------
$ LANG=C make
/bin/sh /home/fedora/hubbitus/rpmbuild/BUILD/php-pecl-parsekit-
1.3/parsekit/libtool --mode=compile cc  -I. -
I/home/fedora/hubbitus/rpmbuild/BUILD/php-pecl-parsekit-1.3/parsekit -
DPHP_ATOM_INC -I/home/fedora/hubbitus/rpmbuild/BUILD/php-pecl-parsekit-
1.3/parsekit/include -I/home/fedora/hubbitus/rpmbuild/BUILD/php-pecl-parsekit-
1.3/parsekit/main -I/home/fedora/hubbitus/rpmbuild/BUILD/php-pecl-parsekit-
1.3/parsekit -I/usr/include/php -I/usr/include/php/main -I/usr/include/php/TSRM 
-I/usr/include/php/Zend -I/usr/include/php/ext -I/usr/include/php/ext/date/lib  
-DHAVE_CONFIG_H  -O2 -g -pipe -Wall -Wp,-D_FORTIFY_SOURCE=2 -fexceptions -
fstack-protector --param=ssp-buffer-size=4 -m64 -mtune=generic   -c 
/home/fedora/hubbitus/rpmbuild/BUILD/php-pecl-parsekit-1.3/parsekit/parsekit.c -
o parsekit.lo 
libtool: compile:  cc -I. -I/home/fedora/hubbitus/rpmbuild/BUILD/php-pecl-
parsekit-1.3/parsekit -DPHP_ATOM_INC -I/home/fedora/hubbitus/rpmbuild/BUILD/php-
pecl-parsekit-1.3/parsekit/include -I/home/fedora/hubbitus/rpmbuild/BUILD/php-
pecl-parsekit-1.3/parsekit/main -I/home/fedora/hubbitus/rpmbuild/BUILD/php-pecl-
parsekit-1.3/parsekit -I/usr/include/php -I/usr/include/php/main -
I/usr/include/php/TSRM -I/usr/include/php/Zend -I/usr/include/php/ext -
I/usr/include/php/ext/date/lib -DHAVE_CONFIG_H -O2 -g -pipe -Wall -Wp,-
D_FORTIFY_SOURCE=2 -fexceptions -fstack-protector --param=ssp-buffer-size=4 -m64 
-mtune=generic -c /home/fedora/hubbitus/rpmbuild/BUILD/php-pecl-parsekit-
1.3/parsekit/parsekit.c  -fPIC -DPIC -o .libs/parsekit.o
/home/fedora/hubbitus/rpmbuild/BUILD/php-pecl-parsekit-1.3/parsekit/parsekit.c: 
In function 'php_parsekit_parse_node':
/home/fedora/hubbitus/rpmbuild/BUILD/php-pecl-parsekit-
1.3/parsekit/parsekit.c:81:66: error: 'union <anonymous>' has no member named 
'var'
/home/fedora/hubbitus/rpmbuild/BUILD/php-pecl-parsekit-
1.3/parsekit/parsekit.c:82:92: error: 'union <anonymous>' has no member named 
'var'
/home/fedora/hubbitus/rpmbuild/BUILD/php-pecl-parsekit-
1.3/parsekit/parsekit.c:82:126: error: 'union <anonymous>' has no member named 
'var'
/home/fedora/hubbitus/rpmbuild/BUILD/php-pecl-parsekit-
1.3/parsekit/parsekit.c:88:77: error: 'union <anonymous>' has no member named 
'var'
/home/fedora/hubbitus/rpmbuild/BUILD/php-pecl-parsekit-
1.3/parsekit/parsekit.c:92:67: error: 'union <anonymous>' has no member named 
'var'
/home/fedora/hubbitus/rpmbuild/BUILD/php-pecl-parsekit-
1.3/parsekit/parsekit.c:117:36: error: 'union <anonymous>' has no member named 
'var'
/home/fedora/hubbitus/rpmbuild/BUILD/php-pecl-parsekit-
1.3/parsekit/parsekit.c:126:75: error: 'union <anonymous>' has no member named 
'EA'
/home/fedora/hubbitus/rpmbuild/BUILD/php-pecl-parsekit-1.3/parsekit/parsekit.c: 
In function 'php_parsekit_parse_op':
/home/fedora/hubbitus/rpmbuild/BUILD/php-pecl-parsekit-
1.3/parsekit/parsekit.c:143:66: warning: cast from pointer to integer of 
different size [-Wpointer-to-int-cast]
/home/fedora/hubbitus/rpmbuild/BUILD/php-pecl-parsekit-
1.3/parsekit/parsekit.c:152:3: warning: passing argument 3 of 
'php_parsekit_parse_node' from incompatible pointer type [enabled by default]
/home/fedora/hubbitus/rpmbuild/BUILD/php-pecl-parsekit-
1.3/parsekit/parsekit.c:66:13: note: expected 'struct znode *' but argument is 
of type 'union znode_op *'
/home/fedora/hubbitus/rpmbuild/BUILD/php-pecl-parsekit-
1.3/parsekit/parsekit.c:161:3: warning: passing argument 3 of 
'php_parsekit_parse_node' from incompatible pointer type [enabled by default]
/home/fedora/hubbitus/rpmbuild/BUILD/php-pecl-parsekit-
1.3/parsekit/parsekit.c:66:13: note: expected 'struct znode *' but argument is 
of type 'union znode_op *'
/home/fedora/hubbitus/rpmbuild/BUILD/php-pecl-parsekit-
1.3/parsekit/parsekit.c:170:3: warning: passing argument 3 of 
'php_parsekit_parse_node' from incompatible pointer type [enabled by default]
/home/fedora/hubbitus/rpmbuild/BUILD/php-pecl-parsekit-
1.3/parsekit/parsekit.c:66:13: note: expected 'struct znode *' but argument is 
of type 'union znode_op *'
/home/fedora/hubbitus/rpmbuild/BUILD/php-pecl-parsekit-1.3/parsekit/parsekit.c: 
In function 'php_parsekit_parse_arginfo':
/home/fedora/hubbitus/rpmbuild/BUILD/php-pecl-parsekit-
1.3/parsekit/parsekit.c:200:3: warning: passing argument 4 of 
'add_assoc_stringl_ex' discards 'const' qualifier from pointer target type 
[enabled by default]
In file included from /usr/include/php/main/php.h:38:0,
                 from /home/fedora/hubbitus/rpmbuild/BUILD/php-pecl-parsekit-
1.3/parsekit/parsekit.c:25:
/usr/include/php/Zend/zend_API.h:375:45: note: expected 'char *' but argument is 
of type 'const char *'
/home/fedora/hubbitus/rpmbuild/BUILD/php-pecl-parsekit-
1.3/parsekit/parsekit.c:202:4: warning: passing argument 4 of 
'add_assoc_stringl_ex' discards 'const' qualifier from pointer target type 
[enabled by default]
In file included from /usr/include/php/main/php.h:38:0,
                 from /home/fedora/hubbitus/rpmbuild/BUILD/php-pecl-parsekit-
1.3/parsekit/parsekit.c:25:
/usr/include/php/Zend/zend_API.h:375:45: note: expected 'char *' but argument is 
of type 'const char *'
/home/fedora/hubbitus/rpmbuild/BUILD/php-pecl-parsekit-1.3/parsekit/parsekit.c: 
In function 'php_parsekit_parse_op_array':
/home/fedora/hubbitus/rpmbuild/BUILD/php-pecl-parsekit-
1.3/parsekit/parsekit.c:269:3: warning: passing argument 4 of 
'add_assoc_string_ex' discards 'const' qualifier from pointer target type 
[enabled by default]
In file included from /usr/include/php/main/php.h:38:0,
                 from /home/fedora/hubbitus/rpmbuild/BUILD/php-pecl-parsekit-
1.3/parsekit/parsekit.c:25:
/usr/include/php/Zend/zend_API.h:374:45: note: expected 'char *' but argument is 
of type 'const char *'
/home/fedora/hubbitus/rpmbuild/BUILD/php-pecl-parsekit-
1.3/parsekit/parsekit.c:277:3: warning: passing argument 4 of 
'add_assoc_stringl_ex' discards 'const' qualifier from pointer target type 
[enabled by default]
In file included from /usr/include/php/main/php.h:38:0,
                 from /home/fedora/hubbitus/rpmbuild/BUILD/php-pecl-parsekit-
1.3/parsekit/parsekit.c:25:
/usr/include/php/Zend/zend_API.h:375:45: note: expected 'char *' but argument is 
of type 'const char *'
/home/fedora/hubbitus/rpmbuild/BUILD/php-pecl-parsekit-
1.3/parsekit/parsekit.c:288:4: warning: passing argument 4 of 
'add_assoc_string_ex' discards 'const' qualifier from pointer target type 
[enabled by default]
In file included from /usr/include/php/main/php.h:38:0,
                 from /home/fedora/hubbitus/rpmbuild/BUILD/php-pecl-parsekit-
1.3/parsekit/parsekit.c:25:
/usr/include/php/Zend/zend_API.h:374:45: note: expected 'char *' but argument is 
of type 'const char *'
/home/fedora/hubbitus/rpmbuild/BUILD/php-pecl-parsekit-
1.3/parsekit/parsekit.c:293:4: warning: passing argument 4 of 
'add_assoc_stringl_ex' discards 'const' qualifier from pointer target type 
[enabled by default]
In file included from /usr/include/php/main/php.h:38:0,
                 from /home/fedora/hubbitus/rpmbuild/BUILD/php-pecl-parsekit-
1.3/parsekit/parsekit.c:25:
/usr/include/php/Zend/zend_API.h:375:45: note: expected 'char *' but argument is 
of type 'const char *'
/home/fedora/hubbitus/rpmbuild/BUILD/php-pecl-parsekit-
1.3/parsekit/parsekit.c:303:99: error: 'zend_op_array' has no member named 
'pass_rest_by_reference'
/home/fedora/hubbitus/rpmbuild/BUILD/php-pecl-parsekit-
1.3/parsekit/parsekit.c:338:3: warning: passing argument 4 of 
'add_assoc_stringl_ex' discards 'const' qualifier from pointer target type 
[enabled by default]
In file included from /usr/include/php/main/php.h:38:0,
                 from /home/fedora/hubbitus/rpmbuild/BUILD/php-pecl-parsekit-
1.3/parsekit/parsekit.c:25:
/usr/include/php/Zend/zend_API.h:375:45: note: expected 'char *' but argument is 
of type 'const char *'
/home/fedora/hubbitus/rpmbuild/BUILD/php-pecl-parsekit-
1.3/parsekit/parsekit.c:377:87: error: 'zend_op_array' has no member named 
'return_reference'
/home/fedora/hubbitus/rpmbuild/BUILD/php-pecl-parsekit-
1.3/parsekit/parsekit.c:380:63: error: 'zend_op_array' has no member named 
'size'
/home/fedora/hubbitus/rpmbuild/BUILD/php-pecl-parsekit-
1.3/parsekit/parsekit.c:383:87: error: 'zend_op_array' has no member named 
'current_brk_cont'
/home/fedora/hubbitus/rpmbuild/BUILD/php-pecl-parsekit-
1.3/parsekit/parsekit.c:384:85: error: 'zend_op_array' has no member named 
'backpatch_count'
/home/fedora/hubbitus/rpmbuild/BUILD/php-pecl-parsekit-
1.3/parsekit/parsekit.c:385:81: error: 'zend_op_array' has no member named 
'done_pass_two'
/home/fedora/hubbitus/rpmbuild/BUILD/php-pecl-parsekit-
1.3/parsekit/parsekit.c:416:9: error: 'zend_op_array' has no member named 
'start_op'
/home/fedora/hubbitus/rpmbuild/BUILD/php-pecl-parsekit-
1.3/parsekit/parsekit.c:419:60: error: 'zend_op_array' has no member named 
'start_op'
/home/fedora/hubbitus/rpmbuild/BUILD/php-pecl-parsekit-
1.3/parsekit/parsekit.c:426:3: warning: passing argument 4 of 
'add_assoc_string_ex' discards 'const' qualifier from pointer target type 
[enabled by default]
In file included from /usr/include/php/main/php.h:38:0,
                 from /home/fedora/hubbitus/rpmbuild/BUILD/php-pecl-parsekit-
1.3/parsekit/parsekit.c:25:
/usr/include/php/Zend/zend_API.h:374:45: note: expected 'char *' but argument is 
of type 'const char *'
/home/fedora/hubbitus/rpmbuild/BUILD/php-pecl-parsekit-
1.3/parsekit/parsekit.c:434:45: error: 'zend_op_array' has no member named 
'size'
/home/fedora/hubbitus/rpmbuild/BUILD/php-pecl-parsekit-1.3/parsekit/parsekit.c: 
In function 'php_parsekit_parse_node_simple':
/home/fedora/hubbitus/rpmbuild/BUILD/php-pecl-parsekit-
1.3/parsekit/parsekit.c:450:14: error: 'union <anonymous>' has no member named 
'var'
/home/fedora/hubbitus/rpmbuild/BUILD/php-pecl-parsekit-
1.3/parsekit/parsekit.c:452:15: error: 'union <anonymous>' has no member named 
'jmp_addr'
/home/fedora/hubbitus/rpmbuild/BUILD/php-pecl-parsekit-
1.3/parsekit/parsekit.c:453:12: error: 'union <anonymous>' has no member named 
'jmp_addr'
/home/fedora/hubbitus/rpmbuild/BUILD/php-pecl-parsekit-
1.3/parsekit/parsekit.c:453:71: error: 'zend_op_array' has no member named 
'size'
/home/fedora/hubbitus/rpmbuild/BUILD/php-pecl-parsekit-
1.3/parsekit/parsekit.c:455:37: error: 'union <anonymous>' has no member named 
'jmp_addr'
/home/fedora/hubbitus/rpmbuild/BUILD/php-pecl-parsekit-
1.3/parsekit/parsekit.c:460:38: error: 'union <anonymous>' has no member named 
'var'
/home/fedora/hubbitus/rpmbuild/BUILD/php-pecl-parsekit-
1.3/parsekit/parsekit.c:517:36: error: 'union <anonymous>' has no member named 
'var'
/home/fedora/hubbitus/rpmbuild/BUILD/php-pecl-parsekit-1.3/parsekit/parsekit.c: 
In function 'php_parsekit_parse_op_array_simple':
/home/fedora/hubbitus/rpmbuild/BUILD/php-pecl-parsekit-
1.3/parsekit/parsekit.c:531:46: error: 'zend_op_array' has no member named 
'size'
/home/fedora/hubbitus/rpmbuild/BUILD/php-pecl-parsekit-
1.3/parsekit/parsekit.c:535:3: warning: passing argument 3 of 
'php_parsekit_parse_node_simple' from incompatible pointer type [enabled by 
default]
/home/fedora/hubbitus/rpmbuild/BUILD/php-pecl-parsekit-
1.3/parsekit/parsekit.c:447:12: note: expected 'struct znode *' but argument is 
of type 'union znode_op *'
/home/fedora/hubbitus/rpmbuild/BUILD/php-pecl-parsekit-
1.3/parsekit/parsekit.c:538:3: warning: passing argument 3 of 
'php_parsekit_parse_node_simple' from incompatible pointer type [enabled by 
default]
/home/fedora/hubbitus/rpmbuild/BUILD/php-pecl-parsekit-
1.3/parsekit/parsekit.c:447:12: note: expected 'struct znode *' but argument is 
of type 'union znode_op *'
/home/fedora/hubbitus/rpmbuild/BUILD/php-pecl-parsekit-
1.3/parsekit/parsekit.c:541:3: warning: passing argument 3 of 
'php_parsekit_parse_node_simple' from incompatible pointer type [enabled by 
default]
/home/fedora/hubbitus/rpmbuild/BUILD/php-pecl-parsekit-
1.3/parsekit/parsekit.c:447:12: note: expected 'struct znode *' but argument is 
of type 'union znode_op *'
/home/fedora/hubbitus/rpmbuild/BUILD/php-pecl-parsekit-1.3/parsekit/parsekit.c: 
In function 'php_parsekit_pop_functions':
/home/fedora/hubbitus/rpmbuild/BUILD/php-pecl-parsekit-
1.3/parsekit/parsekit.c:599:3: warning: pointer targets in passing argument 4 of 
'zend_hash_get_current_key_ex' differ in signedness [-Wpointer-sign]
In file included from /usr/include/php/Zend/zend.h:271:0,
                 from /usr/include/php/main/php.h:34,
                 from /home/fedora/hubbitus/rpmbuild/BUILD/php-pecl-parsekit-
1.3/parsekit/parsekit.c:25:
/usr/include/php/Zend/zend_hash.h:179:45: note: expected 'ulong *' but argument 
is of type 'long int *'
/home/fedora/hubbitus/rpmbuild/BUILD/php-pecl-parsekit-1.3/parsekit/parsekit.c: 
In function 'php_parsekit_parse_class_entry':
/home/fedora/hubbitus/rpmbuild/BUILD/php-pecl-parsekit-
1.3/parsekit/parsekit.c:630:2: warning: passing argument 4 of 
'add_assoc_stringl_ex' discards 'const' qualifier from pointer target type 
[enabled by default]
In file included from /usr/include/php/main/php.h:38:0,
                 from /home/fedora/hubbitus/rpmbuild/BUILD/php-pecl-parsekit-
1.3/parsekit/parsekit.c:25:
/usr/include/php/Zend/zend_API.h:375:45: note: expected 'char *' but argument is 
of type 'const char *'
/home/fedora/hubbitus/rpmbuild/BUILD/php-pecl-parsekit-
1.3/parsekit/parsekit.c:632:3: warning: passing argument 4 of 
'add_assoc_stringl_ex' discards 'const' qualifier from pointer target type 
[enabled by default]
In file included from /usr/include/php/main/php.h:38:0,
                 from /home/fedora/hubbitus/rpmbuild/BUILD/php-pecl-parsekit-
1.3/parsekit/parsekit.c:25:
/usr/include/php/Zend/zend_API.h:375:45: note: expected 'char *' but argument is 
of type 'const char *'
/home/fedora/hubbitus/rpmbuild/BUILD/php-pecl-parsekit-
1.3/parsekit/parsekit.c:636:88: error: 'zend_class_entry' has no member named 
'constants_updated'
/home/fedora/hubbitus/rpmbuild/BUILD/php-pecl-parsekit-
1.3/parsekit/parsekit.c:643:3: warning: passing argument 4 of 
'add_assoc_string_ex' discards 'const' qualifier from pointer target type 
[enabled by default]
In file included from /usr/include/php/main/php.h:38:0,
                 from /home/fedora/hubbitus/rpmbuild/BUILD/php-pecl-parsekit-
1.3/parsekit/parsekit.c:25:
/usr/include/php/Zend/zend_API.h:374:45: note: expected 'char *' but argument is 
of type 'const char *'
/home/fedora/hubbitus/rpmbuild/BUILD/php-pecl-parsekit-
1.3/parsekit/parsekit.c:649:3: warning: passing argument 4 of 
'add_assoc_string_ex' discards 'const' qualifier from pointer target type 
[enabled by default]
In file included from /usr/include/php/main/php.h:38:0,
                 from /home/fedora/hubbitus/rpmbuild/BUILD/php-pecl-parsekit-
1.3/parsekit/parsekit.c:25:
/usr/include/php/Zend/zend_API.h:374:45: note: expected 'char *' but argument is 
of type 'const char *'
/home/fedora/hubbitus/rpmbuild/BUILD/php-pecl-parsekit-
1.3/parsekit/parsekit.c:655:3: warning: passing argument 4 of 
'add_assoc_string_ex' discards 'const' qualifier from pointer target type 
[enabled by default]
In file included from /usr/include/php/main/php.h:38:0,
                 from /home/fedora/hubbitus/rpmbuild/BUILD/php-pecl-parsekit-
1.3/parsekit/parsekit.c:25:
/usr/include/php/Zend/zend_API.h:374:45: note: expected 'char *' but argument is 
of type 'const char *'
/home/fedora/hubbitus/rpmbuild/BUILD/php-pecl-parsekit-
1.3/parsekit/parsekit.c:661:3: warning: passing argument 4 of 
'add_assoc_string_ex' discards 'const' qualifier from pointer target type 
[enabled by default]
In file included from /usr/include/php/main/php.h:38:0,
                 from /home/fedora/hubbitus/rpmbuild/BUILD/php-pecl-parsekit-
1.3/parsekit/parsekit.c:25:
/usr/include/php/Zend/zend_API.h:374:45: note: expected 'char *' but argument is 
of type 'const char *'
/home/fedora/hubbitus/rpmbuild/BUILD/php-pecl-parsekit-
1.3/parsekit/parsekit.c:667:3: warning: passing argument 4 of 
'add_assoc_string_ex' discards 'const' qualifier from pointer target type 
[enabled by default]
In file included from /usr/include/php/main/php.h:38:0,
                 from /home/fedora/hubbitus/rpmbuild/BUILD/php-pecl-parsekit-
1.3/parsekit/parsekit.c:25:
/usr/include/php/Zend/zend_API.h:374:45: note: expected 'char *' but argument is 
of type 'const char *'
/home/fedora/hubbitus/rpmbuild/BUILD/php-pecl-parsekit-
1.3/parsekit/parsekit.c:685:4: warning: passing argument 4 of 
'add_assoc_stringl_ex' discards 'const' qualifier from pointer target type 
[enabled by default]
In file included from /usr/include/php/main/php.h:38:0,
                 from /home/fedora/hubbitus/rpmbuild/BUILD/php-pecl-parsekit-
1.3/parsekit/parsekit.c:25:
/usr/include/php/Zend/zend_API.h:375:45: note: expected 'char *' but argument is 
of type 'const char *'
/home/fedora/hubbitus/rpmbuild/BUILD/php-pecl-parsekit-
1.3/parsekit/parsekit.c:694:8: error: 'zend_class_entry' has no member named 
'static_members'
/home/fedora/hubbitus/rpmbuild/BUILD/php-pecl-parsekit-
1.3/parsekit/parsekit.c:694:53: error: 'zend_class_entry' has no member named 
'static_members'
/home/fedora/hubbitus/rpmbuild/BUILD/php-pecl-parsekit-
1.3/parsekit/parsekit.c:699:163: error: 'zend_class_entry' has no member named 
'static_members'
/home/fedora/hubbitus/rpmbuild/BUILD/php-pecl-parsekit-
1.3/parsekit/parsekit.c:727:72: error: 'zend_class_entry' has no member named 
'filename'
/home/fedora/hubbitus/rpmbuild/BUILD/php-pecl-parsekit-
1.3/parsekit/parsekit.c:728:74: error: 'zend_class_entry' has no member named 
'line_start'
/home/fedora/hubbitus/rpmbuild/BUILD/php-pecl-parsekit-
1.3/parsekit/parsekit.c:729:70: error: 'zend_class_entry' has no member named 
'line_end'
/home/fedora/hubbitus/rpmbuild/BUILD/php-pecl-parsekit-
1.3/parsekit/parsekit.c:730:8: error: 'zend_class_entry' has no member named 
'doc_comment'
/home/fedora/hubbitus/rpmbuild/BUILD/php-pecl-parsekit-
1.3/parsekit/parsekit.c:731:80: error: 'zend_class_entry' has no member named 
'doc_comment'
/home/fedora/hubbitus/rpmbuild/BUILD/php-pecl-parsekit-
1.3/parsekit/parsekit.c:731:97: error: 'zend_class_entry' has no member named 
'doc_comment_len'
/home/fedora/hubbitus/rpmbuild/BUILD/php-pecl-parsekit-
1.3/parsekit/parsekit.c:736:2: warning: passing argument 1 of 'zval_refcount_p' 
from incompatible pointer type [enabled by default]
In file included from /usr/include/php/main/php.h:34:0,
                 from /home/fedora/hubbitus/rpmbuild/BUILD/php-pecl-parsekit-
1.3/parsekit/parsekit.c:25:
/usr/include/php/Zend/zend.h:378:56: note: expected 'struct zval *' but argument 
is of type 'struct zend_class_entry *'
/home/fedora/hubbitus/rpmbuild/BUILD/php-pecl-parsekit-
1.3/parsekit/parsekit.c:760:33: error: 'zend_class_entry' has no member named 
'default_properties'
/home/fedora/hubbitus/rpmbuild/BUILD/php-pecl-parsekit-
1.3/parsekit/parsekit.c:765:165: error: 'zend_class_entry' has no member named 
'default_properties'
/home/fedora/hubbitus/rpmbuild/BUILD/php-pecl-parsekit-1.3/parsekit/parsekit.c: 
In function 'php_parsekit_pop_classes':
/home/fedora/hubbitus/rpmbuild/BUILD/php-pecl-parsekit-
1.3/parsekit/parsekit.c:809:3: warning: pointer targets in passing argument 4 of 
'zend_hash_get_current_key_ex' differ in signedness [-Wpointer-sign]
In file included from /usr/include/php/Zend/zend.h:271:0,
                 from /usr/include/php/main/php.h:34,
                 from /home/fedora/hubbitus/rpmbuild/BUILD/php-pecl-parsekit-
1.3/parsekit/parsekit.c:25:
/usr/include/php/Zend/zend_hash.h:179:45: note: expected 'ulong *' but argument 
is of type 'long int *'
/home/fedora/hubbitus/rpmbuild/BUILD/php-pecl-parsekit-1.3/parsekit/parsekit.c: 
In function 'zif_parsekit_func_arginfo':
/home/fedora/hubbitus/rpmbuild/BUILD/php-pecl-parsekit-
1.3/parsekit/parsekit.c:1048:11: warning: assignment discards 'const' qualifier 
from pointer target type [enabled by default]
/home/fedora/hubbitus/rpmbuild/BUILD/php-pecl-parsekit-1.3/parsekit/parsekit.c: 
At top level:
/home/fedora/hubbitus/rpmbuild/BUILD/php-pecl-parsekit-
1.3/parsekit/parsekit.c:1134:1: error: unknown type name 'function_entry'
/home/fedora/hubbitus/rpmbuild/BUILD/php-pecl-parsekit-
1.3/parsekit/parsekit.c:1135:2: warning: braces around scalar initializer 
[enabled by default]
/home/fedora/hubbitus/rpmbuild/BUILD/php-pecl-parsekit-
1.3/parsekit/parsekit.c:1135:2: warning: (near initialization for 
'parsekit_functions[0]') [enabled by default]
/home/fedora/hubbitus/rpmbuild/BUILD/php-pecl-parsekit-
1.3/parsekit/parsekit.c:1135:2: warning: initialization makes integer from 
pointer without a cast [enabled by default]
/home/fedora/hubbitus/rpmbuild/BUILD/php-pecl-parsekit-
1.3/parsekit/parsekit.c:1135:2: warning: (near initialization for 
'parsekit_functions[0]') [enabled by default]
/home/fedora/hubbitus/rpmbuild/BUILD/php-pecl-parsekit-
1.3/parsekit/parsekit.c:1135:2: error: initializer element is not computable at 
load time
/home/fedora/hubbitus/rpmbuild/BUILD/php-pecl-parsekit-
1.3/parsekit/parsekit.c:1135:2: error: (near initialization for 
'parsekit_functions[0]')
/home/fedora/hubbitus/rpmbuild/BUILD/php-pecl-parsekit-
1.3/parsekit/parsekit.c:1135:2: warning: excess elements in scalar initializer 
[enabled by default]
/home/fedora/hubbitus/rpmbuild/BUILD/php-pecl-parsekit-
1.3/parsekit/parsekit.c:1135:2: warning: (near initialization for 
'parsekit_functions[0]') [enabled by default]
/home/fedora/hubbitus/rpmbuild/BUILD/php-pecl-parsekit-
1.3/parsekit/parsekit.c:1135:2: warning: excess elements in scalar initializer 
[enabled by default]
/home/fedora/hubbitus/rpmbuild/BUILD/php-pecl-parsekit-
1.3/parsekit/parsekit.c:1135:2: warning: (near initialization for 
'parsekit_functions[0]') [enabled by default]
/home/fedora/hubbitus/rpmbuild/BUILD/php-pecl-parsekit-
1.3/parsekit/parsekit.c:1135:164: warning: excess elements in scalar initializer 
[enabled by default]
/home/fedora/hubbitus/rpmbuild/BUILD/php-pecl-parsekit-
1.3/parsekit/parsekit.c:1135:164: warning: (near initialization for 
'parsekit_functions[0]') [enabled by default]
/home/fedora/hubbitus/rpmbuild/BUILD/php-pecl-parsekit-
1.3/parsekit/parsekit.c:1135:164: warning: excess elements in scalar initializer 
[enabled by default]
/home/fedora/hubbitus/rpmbuild/BUILD/php-pecl-parsekit-
1.3/parsekit/parsekit.c:1135:164: warning: (near initialization for 
'parsekit_functions[0]') [enabled by default]
/home/fedora/hubbitus/rpmbuild/BUILD/php-pecl-parsekit-
1.3/parsekit/parsekit.c:1136:2: warning: braces around scalar initializer 
[enabled by default]
/home/fedora/hubbitus/rpmbuild/BUILD/php-pecl-parsekit-
1.3/parsekit/parsekit.c:1136:2: warning: (near initialization for 
'parsekit_functions[1]') [enabled by default]
/home/fedora/hubbitus/rpmbuild/BUILD/php-pecl-parsekit-
1.3/parsekit/parsekit.c:1136:2: warning: initialization makes integer from 
pointer without a cast [enabled by default]
/home/fedora/hubbitus/rpmbuild/BUILD/php-pecl-parsekit-
1.3/parsekit/parsekit.c:1136:2: warning: (near initialization for 
'parsekit_functions[1]') [enabled by default]
/home/fedora/hubbitus/rpmbuild/BUILD/php-pecl-parsekit-
1.3/parsekit/parsekit.c:1136:2: error: initializer element is not computable at 
load time
/home/fedora/hubbitus/rpmbuild/BUILD/php-pecl-parsekit-
1.3/parsekit/parsekit.c:1136:2: error: (near initialization for 
'parsekit_functions[1]')
/home/fedora/hubbitus/rpmbuild/BUILD/php-pecl-parsekit-
1.3/parsekit/parsekit.c:1136:2: warning: excess elements in scalar initializer 
[enabled by default]
/home/fedora/hubbitus/rpmbuild/BUILD/php-pecl-parsekit-
1.3/parsekit/parsekit.c:1136:2: warning: (near initialization for 
'parsekit_functions[1]') [enabled by default]
/home/fedora/hubbitus/rpmbuild/BUILD/php-pecl-parsekit-
1.3/parsekit/parsekit.c:1136:2: warning: excess elements in scalar initializer 
[enabled by default]
/home/fedora/hubbitus/rpmbuild/BUILD/php-pecl-parsekit-
1.3/parsekit/parsekit.c:1136:2: warning: (near initialization for 
'parsekit_functions[1]') [enabled by default]
/home/fedora/hubbitus/rpmbuild/BUILD/php-pecl-parsekit-
1.3/parsekit/parsekit.c:1136:160: warning: excess elements in scalar initializer 
[enabled by default]
/home/fedora/hubbitus/rpmbuild/BUILD/php-pecl-parsekit-
1.3/parsekit/parsekit.c:1136:160: warning: (near initialization for 
'parsekit_functions[1]') [enabled by default]
/home/fedora/hubbitus/rpmbuild/BUILD/php-pecl-parsekit-
1.3/parsekit/parsekit.c:1136:160: warning: excess elements in scalar initializer 
[enabled by default]
/home/fedora/hubbitus/rpmbuild/BUILD/php-pecl-parsekit-
1.3/parsekit/parsekit.c:1136:160: warning: (near initialization for 
'parsekit_functions[1]') [enabled by default]
/home/fedora/hubbitus/rpmbuild/BUILD/php-pecl-parsekit-
1.3/parsekit/parsekit.c:1137:2: warning: braces around scalar initializer 
[enabled by default]
/home/fedora/hubbitus/rpmbuild/BUILD/php-pecl-parsekit-
1.3/parsekit/parsekit.c:1137:2: warning: (near initialization for 
'parsekit_functions[2]') [enabled by default]
/home/fedora/hubbitus/rpmbuild/BUILD/php-pecl-parsekit-
1.3/parsekit/parsekit.c:1137:2: warning: initialization makes integer from 
pointer without a cast [enabled by default]
/home/fedora/hubbitus/rpmbuild/BUILD/php-pecl-parsekit-
1.3/parsekit/parsekit.c:1137:2: warning: (near initialization for 
'parsekit_functions[2]') [enabled by default]
/home/fedora/hubbitus/rpmbuild/BUILD/php-pecl-parsekit-
1.3/parsekit/parsekit.c:1137:2: error: initializer element is not computable at 
load time
/home/fedora/hubbitus/rpmbuild/BUILD/php-pecl-parsekit-
1.3/parsekit/parsekit.c:1137:2: error: (near initialization for 
'parsekit_functions[2]')
/home/fedora/hubbitus/rpmbuild/BUILD/php-pecl-parsekit-
1.3/parsekit/parsekit.c:1137:2: warning: excess elements in scalar initializer 
[enabled by default]
/home/fedora/hubbitus/rpmbuild/BUILD/php-pecl-parsekit-
1.3/parsekit/parsekit.c:1137:2: warning: (near initialization for 
'parsekit_functions[2]') [enabled by default]
/home/fedora/hubbitus/rpmbuild/BUILD/php-pecl-parsekit-
1.3/parsekit/parsekit.c:1137:2: warning: excess elements in scalar initializer 
[enabled by default]
/home/fedora/hubbitus/rpmbuild/BUILD/php-pecl-parsekit-
1.3/parsekit/parsekit.c:1137:2: warning: (near initialization for 
'parsekit_functions[2]') [enabled by default]
/home/fedora/hubbitus/rpmbuild/BUILD/php-pecl-parsekit-
1.3/parsekit/parsekit.c:1137:116: warning: excess elements in scalar initializer 
[enabled by default]
/home/fedora/hubbitus/rpmbuild/BUILD/php-pecl-parsekit-
1.3/parsekit/parsekit.c:1137:116: warning: (near initialization for 
'parsekit_functions[2]') [enabled by default]
/home/fedora/hubbitus/rpmbuild/BUILD/php-pecl-parsekit-
1.3/parsekit/parsekit.c:1137:116: warning: excess elements in scalar initializer 
[enabled by default]
/home/fedora/hubbitus/rpmbuild/BUILD/php-pecl-parsekit-
1.3/parsekit/parsekit.c:1137:116: warning: (near initialization for 
'parsekit_functions[2]') [enabled by default]
/home/fedora/hubbitus/rpmbuild/BUILD/php-pecl-parsekit-
1.3/parsekit/parsekit.c:1138:2: warning: braces around scalar initializer 
[enabled by default]
/home/fedora/hubbitus/rpmbuild/BUILD/php-pecl-parsekit-
1.3/parsekit/parsekit.c:1138:2: warning: (near initialization for 
'parsekit_functions[3]') [enabled by default]
/home/fedora/hubbitus/rpmbuild/BUILD/php-pecl-parsekit-
1.3/parsekit/parsekit.c:1138:2: warning: initialization makes integer from 
pointer without a cast [enabled by default]
/home/fedora/hubbitus/rpmbuild/BUILD/php-pecl-parsekit-
1.3/parsekit/parsekit.c:1138:2: warning: (near initialization for 
'parsekit_functions[3]') [enabled by default]
/home/fedora/hubbitus/rpmbuild/BUILD/php-pecl-parsekit-
1.3/parsekit/parsekit.c:1138:2: error: initializer element is not computable at 
load time
/home/fedora/hubbitus/rpmbuild/BUILD/php-pecl-parsekit-
1.3/parsekit/parsekit.c:1138:2: error: (near initialization for 
'parsekit_functions[3]')
/home/fedora/hubbitus/rpmbuild/BUILD/php-pecl-parsekit-
1.3/parsekit/parsekit.c:1138:2: warning: excess elements in scalar initializer 
[enabled by default]
/home/fedora/hubbitus/rpmbuild/BUILD/php-pecl-parsekit-
1.3/parsekit/parsekit.c:1138:2: warning: (near initialization for 
'parsekit_functions[3]') [enabled by default]
/home/fedora/hubbitus/rpmbuild/BUILD/php-pecl-parsekit-
1.3/parsekit/parsekit.c:1138:2: warning: excess elements in scalar initializer 
[enabled by default]
/home/fedora/hubbitus/rpmbuild/BUILD/php-pecl-parsekit-
1.3/parsekit/parsekit.c:1138:2: warning: (near initialization for 
'parsekit_functions[3]') [enabled by default]
/home/fedora/hubbitus/rpmbuild/BUILD/php-pecl-parsekit-
1.3/parsekit/parsekit.c:1138:114: warning: excess elements in scalar initializer 
[enabled by default]
/home/fedora/hubbitus/rpmbuild/BUILD/php-pecl-parsekit-
1.3/parsekit/parsekit.c:1138:114: warning: (near initialization for 
'parsekit_functions[3]') [enabled by default]
/home/fedora/hubbitus/rpmbuild/BUILD/php-pecl-parsekit-
1.3/parsekit/parsekit.c:1138:114: warning: excess elements in scalar initializer 
[enabled by default]
/home/fedora/hubbitus/rpmbuild/BUILD/php-pecl-parsekit-
1.3/parsekit/parsekit.c:1138:114: warning: (near initialization for 
'parsekit_functions[3]') [enabled by default]
/home/fedora/hubbitus/rpmbuild/BUILD/php-pecl-parsekit-
1.3/parsekit/parsekit.c:1139:2: warning: braces around scalar initializer 
[enabled by default]
/home/fedora/hubbitus/rpmbuild/BUILD/php-pecl-parsekit-
1.3/parsekit/parsekit.c:1139:2: warning: (near initialization for 
'parsekit_functions[4]') [enabled by default]
/home/fedora/hubbitus/rpmbuild/BUILD/php-pecl-parsekit-
1.3/parsekit/parsekit.c:1139:2: warning: initialization makes integer from 
pointer without a cast [enabled by default]
/home/fedora/hubbitus/rpmbuild/BUILD/php-pecl-parsekit-
1.3/parsekit/parsekit.c:1139:2: warning: (near initialization for 
'parsekit_functions[4]') [enabled by default]
/home/fedora/hubbitus/rpmbuild/BUILD/php-pecl-parsekit-
1.3/parsekit/parsekit.c:1139:2: error: initializer element is not computable at 
load time
/home/fedora/hubbitus/rpmbuild/BUILD/php-pecl-parsekit-
1.3/parsekit/parsekit.c:1139:2: error: (near initialization for 
'parsekit_functions[4]')
/home/fedora/hubbitus/rpmbuild/BUILD/php-pecl-parsekit-
1.3/parsekit/parsekit.c:1139:2: warning: excess elements in scalar initializer 
[enabled by default]
/home/fedora/hubbitus/rpmbuild/BUILD/php-pecl-parsekit-
1.3/parsekit/parsekit.c:1139:2: warning: (near initialization for 
'parsekit_functions[4]') [enabled by default]
/home/fedora/hubbitus/rpmbuild/BUILD/php-pecl-parsekit-
1.3/parsekit/parsekit.c:1139:2: warning: excess elements in scalar initializer 
[enabled by default]
/home/fedora/hubbitus/rpmbuild/BUILD/php-pecl-parsekit-
1.3/parsekit/parsekit.c:1139:2: warning: (near initialization for 
'parsekit_functions[4]') [enabled by default]
/home/fedora/hubbitus/rpmbuild/BUILD/php-pecl-parsekit-
1.3/parsekit/parsekit.c:1139:116: warning: excess elements in scalar initializer 
[enabled by default]
/home/fedora/hubbitus/rpmbuild/BUILD/php-pecl-parsekit-
1.3/parsekit/parsekit.c:1139:116: warning: (near initialization for 
'parsekit_functions[4]') [enabled by default]
/home/fedora/hubbitus/rpmbuild/BUILD/php-pecl-parsekit-
1.3/parsekit/parsekit.c:1139:116: warning: excess elements in scalar initializer 
[enabled by default]
/home/fedora/hubbitus/rpmbuild/BUILD/php-pecl-parsekit-
1.3/parsekit/parsekit.c:1139:116: warning: (near initialization for 
'parsekit_functions[4]') [enabled by default]
/home/fedora/hubbitus/rpmbuild/BUILD/php-pecl-parsekit-
1.3/parsekit/parsekit.c:1140:2: warning: braces around scalar initializer 
[enabled by default]
/home/fedora/hubbitus/rpmbuild/BUILD/php-pecl-parsekit-
1.3/parsekit/parsekit.c:1140:2: warning: (near initialization for 
'parsekit_functions[5]') [enabled by default]
/home/fedora/hubbitus/rpmbuild/BUILD/php-pecl-parsekit-
1.3/parsekit/parsekit.c:1140:2: warning: initialization makes integer from 
pointer without a cast [enabled by default]
/home/fedora/hubbitus/rpmbuild/BUILD/php-pecl-parsekit-
1.3/parsekit/parsekit.c:1140:2: warning: (near initialization for 
'parsekit_functions[5]') [enabled by default]
/home/fedora/hubbitus/rpmbuild/BUILD/php-pecl-parsekit-
1.3/parsekit/parsekit.c:1140:2: warning: excess elements in scalar initializer 
[enabled by default]
/home/fedora/hubbitus/rpmbuild/BUILD/php-pecl-parsekit-
1.3/parsekit/parsekit.c:1140:2: warning: (near initialization for 
'parsekit_functions[5]') [enabled by default]
/home/fedora/hubbitus/rpmbuild/BUILD/php-pecl-parsekit-
1.3/parsekit/parsekit.c:1140:2: warning: excess elements in scalar initializer 
[enabled by default]
/home/fedora/hubbitus/rpmbuild/BUILD/php-pecl-parsekit-
1.3/parsekit/parsekit.c:1140:2: warning: (near initialization for 
'parsekit_functions[5]') [enabled by default]
/home/fedora/hubbitus/rpmbuild/BUILD/php-pecl-parsekit-
1.3/parsekit/parsekit.c:1151:2: warning: initialization from incompatible 
pointer type [enabled by default]
/home/fedora/hubbitus/rpmbuild/BUILD/php-pecl-parsekit-
1.3/parsekit/parsekit.c:1151:2: warning: (near initialization for 
'parsekit_module_entry.functions') [enabled by default]
make: *** [parsekit.lo] Error 1


Patches

php-pecl-parsekit-1.3-php-5.4.patch (last revision 2014-08-18 07:56 UTC by pahan at hubbitus dot info)

Add a Patch

Pull Requests

Add a Pull Request

History

AllCommentsChangesGit/SVN commitsRelated reports
 [2012-08-01 19:38 UTC] roberto at spadim dot com dot br
donĀ“t work with php 5.4.5 too :(
 [2017-04-01 21:16 UTC] tpunt@php.net
-Status: Open +Status: Wont fix
 [2017-04-01 21:16 UTC] tpunt@php.net
Due to this extension not seeing any activity since 2009, this issue will not be fixed. We are therefore closing this now.
 
PHP Copyright © 2001-2019 The PHP Group
All rights reserved.
Last updated: Sun Mar 24 13:01:25 2019 UTC