php.net |  support |  documentation |  report a bug |  advanced search |  search howto |  statistics |  random bug |  login
Bug #59800 compile error
Submitted: 2011-06-03 07:53 UTC Modified: 2013-02-18 00:35 UTC
Votes:1
Avg. Score:5.0 ± 0.0
Reproduced:1 of 1 (100.0%)
Same Version:0 (0.0%)
Same OS:0 (0.0%)
From: pli at poly dot edu Assigned:
Status: No Feedback Package: zip (PECL)
PHP Version: 5.3.2 OS: Ubuntu Server 10.04
Private report: No CVE-ID: None
Have you experienced this issue?
Rate the importance of this bug to you:

 [2011-06-03 07:53 UTC] pli at poly dot edu
Description:
------------
Fresh install. Upgrading from an older version of Ubuntu 
Server.
Elected LAMP server from OS install options.
I've also installed phpmyadmin, php-pear, and php5-dev.
I feel like I'm missing something that was automatically 
installed before, or a new dependency was added...

make failed using "pecl install zip"

Reproduce code:
---------------
downloading zip-1.10.2.tgz ...
Starting to download zip-1.10.2.tgz (236,912 bytes)
....................................done: 236,912 bytes
61 source files, building
running: phpize
Configuring for:
PHP Api Version:         20090626
Zend Module Api No:      20090626
Zend Extension Api No:   220090626
building in /tmp/pear/temp/pear-build-root92JQyd/zip-1.10.2
running: /tmp/pear/temp/zip/configure
checking for grep that handles long lines and -e... /bin/grep
checking for egrep... /bin/grep -E
checking for a sed that does not truncate output... /bin/sed
checking for cc... cc
checking whether the C compiler works... yes
checking for C compiler default output file name... a.out
checking for suffix of executables...
checking whether we are cross compiling... no
checking for suffix of object files... o
checking whether we are using the GNU C compiler... yes
checking whether cc accepts -g... yes
checking for cc option to accept ISO C89... none needed
checking how to run the C preprocessor... cc -E
checking for icc... no
checking for suncc... no
checking whether cc understands -c and -o together... yes
checking for system library directory... lib
checking if compiler supports -R... no
checking if compiler supports -Wl,-rpath,... yes
checking build system type... i686-pc-linux-gnu
checking host system type... i686-pc-linux-gnu
checking target system type... i686-pc-linux-gnu
checking for PHP prefix... /usr
checking for PHP includes... -I/usr/include/php5 -I/usr/include/php5/main -I/usr/include/php5/TSRM -I/usr/include/php5/Zend -I/usr/include/php5/ext -I/usr/include/php5/ext/date/lib -D_LARGEFILE_SOURCE -D_FILE_OFFSET_BITS=64
checking for PHP extension directory... /usr/lib/php5/20090626+lfs
checking for PHP installed headers prefix... /usr/include/php5
checking if debug is enabled... no
checking if zts is enabled... no
checking for re2c... no
configure: WARNING: You will need re2c 0.13.4 or later if you want to regenerate PHP parsers.
checking for gawk... gawk
checking for zip archive read/writesupport... yes, shared
checking for the location of libz... no
checking pcre install prefix... no
checking for the location of zlib... /usr
checking for a sed that does not truncate output... (cached) /bin/sed
checking for fgrep... /bin/grep -F
checking for ld used by cc... /usr/bin/ld
checking if the linker (/usr/bin/ld) is GNU ld... yes
checking for BSD- or MS-compatible name lister (nm)... /usr/bin/nm -B
checking the name lister (/usr/bin/nm -B) interface... BSD nm
checking whether ln -s works... yes
checking the maximum length of command line arguments... 1572864
checking whether the shell understands some XSI constructs... yes
checking whether the shell understands "+="... yes
checking for /usr/bin/ld option to reload object files... -r
checking for objdump... objdump
checking how to recognize dependent libraries... pass_all
checking for ar... ar
checking for strip... strip
checking for ranlib... ranlib
checking command to parse /usr/bin/nm -B output from cc object... ok
checking for ANSI C header files... yes
checking for sys/types.h... yes
checking for sys/stat.h... yes
checking for stdlib.h... yes
checking for string.h... yes
checking for memory.h... yes
checking for strings.h... yes
checking for inttypes.h... yes
checking for stdint.h... yes
checking for unistd.h... yes
checking for dlfcn.h... yes
checking for objdir... .libs
checking if cc supports -fno-rtti -fno-exceptions... no
checking for cc option to produce PIC... -fPIC -DPIC
checking if cc PIC flag -fPIC -DPIC works... yes
checking if cc static flag -static works... yes
checking if cc supports -c -o file.o... yes
checking if cc supports -c -o file.o... (cached) yes
checking whether the cc linker (/usr/bin/ld) supports shared libraries... yes
checking whether -lc should be explicitly linked in... no
checking dynamic linker characteristics... GNU/Linux ld.so
checking how to hardcode library paths into programs... immediate
checking whether stripping libraries is possible... yes
checking if libtool supports shared libraries... yes
checking whether to build shared libraries... yes
checking whether to build static libraries... no
configure: creating ./config.status
config.status: creating config.h
config.status: executing libtool commands
running: make
/bin/bash /tmp/pear/temp/pear-build-root92JQyd/zip-1.10.2/libtool --mode=compile cc  -I. -I/tmp/pear/temp/zip -DPHP_ATOM_INC -I/tmp/pear/temp/pear-build-root92JQyd/zip-1.10.2/include -I/tmp/pear/temp/pear-build-root92JQyd/zip-1.10.2/main -I/tmp/pear/temp/zip -I/usr/include/php5 -I/usr/include/php5/main -I/usr/include/php5/TSRM -I/usr/include/php5/Zend -I/usr/include/php5/ext -I/usr/include/php5/ext/date/lib -D_LARGEFILE_SOURCE -D_FILE_OFFSET_BITS=64  -DHAVE_CONFIG_H  -g -O2   -c /tmp/pear/temp/zip/php_zip.c -o php_zip.lo
libtool: compile:  cc -I. -I/tmp/pear/temp/zip -DPHP_ATOM_INC -I/tmp/pear/temp/pear-build-root92JQyd/zip-1.10.2/include -I/tmp/pear/temp/pear-build-root92JQyd/zip-1.10.2/main -I/tmp/pear/temp/zip -I/usr/include/php5 -I/usr/include/php5/main -I/usr/include/php5/TSRM -I/usr/include/php5/Zend -I/usr/include/php5/ext -I/usr/include/php5/ext/date/lib -D_LARGEFILE_SOURCE -D_FILE_OFFSET_BITS=64 -DHAVE_CONFIG_H -g -O2 -c /tmp/pear/temp/zip/php_zip.c  -fPIC -DPIC -o .libs/php_zip.o
In file included from /tmp/pear/temp/zip/php_zip.c:30:
/usr/include/php5/ext/pcre/php_pcre.h:29:18: error: pcre.h: No such file or directory
In file included from /tmp/pear/temp/zip/php_zip.c:30:
/usr/include/php5/ext/pcre/php_pcre.h:37: error: expected ‘=’, ‘,’, ‘;’, ‘asm’ or ‘__attribute__’ before ‘*’ token
/usr/include/php5/ext/pcre/php_pcre.h:38: error: expected ‘=’, ‘,’, ‘;’, ‘asm’ or ‘__attribute__’ before ‘*’ token
/usr/include/php5/ext/pcre/php_pcre.h:44: error: expected specifier-qualifier-list before ‘pcre’
/tmp/pear/temp/zip/php_zip.c: In function ‘php_zip_pcre’:
/tmp/pear/temp/zip/php_zip.c:601: error: ‘pcre’ undeclared (first use in this function)
/tmp/pear/temp/zip/php_zip.c:601: error: (Each undeclared identifier is reported only once
/tmp/pear/temp/zip/php_zip.c:601: error: for each function it appears in.)
/tmp/pear/temp/zip/php_zip.c:601: error: ‘re’ undeclared (first use in this function)
/tmp/pear/temp/zip/php_zip.c:602: error: ‘pcre_extra’ undeclared (first use in this function)
make: *** [php_zip.lo] Error 1
ERROR: `make' failed


Expected result:
----------------
make complete


Patches

Add a Patch

Pull Requests

Add a Pull Request

History

AllCommentsChangesGit/SVN commitsRelated reports
 [2011-06-03 07:58 UTC] pli at poly dot edu
whoops... character encoding issue. my fault. here are the 
last few lines again.

In file included from /tmp/pear/temp/zip/php_zip.c:30:
/usr/include/php5/ext/pcre/php_pcre.h:29:18: error: pcre.h: 
No such file or directory
In file included from /tmp/pear/temp/zip/php_zip.c:30:
/usr/include/php5/ext/pcre/php_pcre.h:37: error: expected 
?=?, ?,?, ?;?, ?asm? or ?__attribute__? before ?*? token
/usr/include/php5/ext/pcre/php_pcre.h:38: error: expected 
?=?, ?,?, ?;?, ?asm? or ?__attribute__? before ?*? token
/usr/include/php5/ext/pcre/php_pcre.h:44: error: expected 
specifier-qualifier-list before ?pcre?
/tmp/pear/temp/zip/php_zip.c: In function ?php_zip_pcre?:
/tmp/pear/temp/zip/php_zip.c:601: error: ?pcre? undeclared 
(first use in this function)
/tmp/pear/temp/zip/php_zip.c:601: error: (Each undeclared 
identifier is reported only once
/tmp/pear/temp/zip/php_zip.c:601: error: for each function 
it appears in.)
/tmp/pear/temp/zip/php_zip.c:601: error: ?re? undeclared 
(first use in this function)
/tmp/pear/temp/zip/php_zip.c:602: error: ?pcre_extra? 
undeclared (first use in this function)
make: *** [php_zip.lo] Error 1
ERROR: `make' failed
 [2011-09-18 20:27 UTC] pierre@php.net
Can you try to install the pcre development file and try again 
the pecl install?
 [2013-02-18 00:35 UTC] pecl-dev at lists dot php dot net
No feedback was provided. The bug is being suspended because
we assume that you are no longer experiencing the problem.
If this is not the case and you are able to provide the
information that was requested earlier, please do so and
change the status of the bug back to "Open". Thank you.
 
PHP Copyright © 2001-2021 The PHP Group
All rights reserved.
Last updated: Wed Sep 29 03:03:33 2021 UTC