php.net |  support |  documentation |  report a bug |  advanced search |  search howto |  statistics |  random bug |  login
Bug #4038 compilation fails on basic_functions.c:324
Submitted: 2000-04-04 19:04 UTC Modified: 2000-04-27 13:39 UTC
From: boerm at u dot washington dot edu Assigned:
Status: Closed Package: Compile Failure
PHP Version: 4.0 Release Candidate 1 OS: Compaq Tru64 4.0D (alphaev56-dec
Private report: No CVE-ID: None
 [2000-04-04 19:04 UTC] boerm at u dot washington dot edu
Quoting from std output:

basic_functions.c:324: `php_if_dl' undeclared here (not in a function)
basic_functions.c:324: initializer element is not constant
basic_functions.c:324: (near initialization for `basic_functions[201].handler')
basic_functions.c: In function `php_putenv_destructor':
basic_functions.c:549: warning: implicit declaration of function `unsetenv'
basic_functions.c: In function `php_info_basic':
basic_functions.c:708: warning: implicit declaration of function `php_info_dl'
basic_functions.c: In function `php_if_usleep':
basic_functions.c:940: warning: implicit declaration of function `usleep'
gmake[3]: *** [basic_functions.lo] Error 1
gmake[3]: Leaving directory `/usr/local/work/php-4.0RC1/ext/standard'
gmake[2]: *** [all-recursive] Error 1
gmake[2]: Leaving directory `/usr/local/work/php-4.0RC1/ext/standard'
gmake[1]: *** [all] Error 1
gmake[1]: Leaving directory `/usr/local/work/php-4.0RC1/ext'
gmake: *** [all-recursive] Error 1

Patches

Pull Requests

History

AllCommentsChangesGit/SVN commitsRelated reports
 [2000-04-27 13:39 UTC] sas at cvs dot php dot net
Fixed in CVS
 
PHP Copyright © 2001-2026 The PHP Group
All rights reserved.
Last updated: Tue Oct 13 12:00:02 2026 UTC