php.net |  support |  documentation |  report a bug |  advanced search |  search howto |  statistics |  random bug |  login
Bug #3962 crypt.c compile errors
Submitted: 2000-03-29 14:58 UTC Modified: 2000-03-29 23:47 UTC
From: joe at soundprint dot org Assigned:
Status: Closed Package: Compile Failure
PHP Version: 4.0 Latest CVS (29/03/2000) OS: redhat 6.1
Private report: No CVE-ID: None
 [2000-03-29 14:58 UTC] joe at soundprint dot org
when compiling with ./configure --with-apxs=/usr/local/apache/bin/apxs --with-mysql=/usr/local/mysql the compilation is terminated with an error:

make[3]: Entering directory `/home/joe/cvs/php4/ext/standard'
/bin/sh ../../libtool --silent --mode=compile gcc -DHAVE_CONFIG_H -I.
-I/home/joe/cvs/php4/ext/standard -I../.. -I../../Zend
-I/home/joe/cvs/php4 -I/usr/local/apache/include
-I/usr/local/mysql/include -I/home/joe/cvs/php4/ext/xml/expat/xmltok
-I/home/joe/cvs/php4/ext/xml/expat/xmlparse  -DXML_BYTE_ORDER=12
-D_REENTRANT -g -O2 -Wall  -c crypt.c
crypt.c: In function `php_if_crypt':
crypt.c:110: `PHP_MAX_SALT_LEN' undeclared (first use in this function)
crypt.c:110: (Each undeclared identifier is reported only once
crypt.c:110: for each function it appears in.)
crypt.c:110: size of array `salt' has non-integer type
crypt.c: At top level:
crypt.c:101: warning: `php_to64' defined but not used
make[3]: *** [crypt.lo] Error 1
make[3]: Leaving directory `/home/joe/cvs/php4/ext/standard'
make[2]: *** [all-recursive] Error 1
make[2]: Leaving directory `/home/joe/cvs/php4/ext/standard'
make[1]: *** [all] Error 1
make[1]: Leaving directory `/home/joe/cvs/php4/ext'
make: *** [all-recursive] Error 1

Patches

Pull Requests

History

AllCommentsChangesGit/SVN commitsRelated reports
 [2000-03-29 23:47 UTC] sas at cvs dot php dot net
Are you using the binary MySQL RPMs? If yes, don't specify --with-mysql so that the bundled MySQL will be used.
 
PHP Copyright © 2001-2026 The PHP Group
All rights reserved.
Last updated: Sun Oct 11 07:00:02 2026 UTC