php.net |  support |  documentation |  report a bug |  advanced search |  search howto |  statistics |  random bug |  login
Bug #17935 apache v2 compile problem since CVS 2002/06/19
Submitted: 2002-06-23 18:24 UTC Modified: 2002-06-23 18:29 UTC
Votes:1
Avg. Score:5.0 ± 0.0
Reproduced:1 of 1 (100.0%)
Same Version:1 (100.0%)
Same OS:1 (100.0%)
From: mw at suk dot net Assigned:
Status: Closed Package: Compile Failure
PHP Version: 4.0CVS-2002-06-23 OS: RedHat Linux 7.3
Private report: No CVE-ID: None
 [2002-06-23 18:24 UTC] mw at suk dot net
Latest working CVS version of PHP 4.3 with Apache v2.0.36 was on 18th June (CVS: 200206181800). Later on, starting from 19th the problem exists:

Making install in apache2filter
make[2]: Entering directory `/usr/src/server2/php4-STABLE-200206231500/sapi/apache2filter'
make[3]: Entering directory `/usr/src/server2/php4-STABLE-200206231500/sapi/apache2filter'
/bin/sh /usr/src/server2/php4-STABLE-200206231500/libtool --silent --mode=compile gcc  -I. -I/usr/src/server2/php4-STABLE-200206231500/sapi/apache2filter -I/usr/src/server2/php4-STABLE-200206231500/main -I/usr/src/server2/php4-STABLE-200206231500 -I/usr/server-test/include -I/usr/src/server2/php4-STABLE-200206231500/Zend -I/usr/local/include -I/usr/include/mysql -I/usr/src/server2/php4-STABLE-200206231500/ext/xml/expat  -D_REENTRANT -I/usr/src/server2/php4-STABLE-200206231500/TSRM -g -O2 -pthread -DZTS -prefer-pic  -c php_functions.c
php_functions.c:93:27: missing binary operator before '!'
make[3]: *** [php_functions.lo] Error 1
make[3]: Leaving directory `/usr/src/server2/php4-STABLE-200206231500/sapi/apache2filter'
make[2]: *** [install-recursive] Error 1
make[2]: Leaving directory `/usr/src/server2/php4-STABLE-200206231500/sapi/apache2filter'
make[1]: *** [install-recursive] Error 1
make[1]: Leaving directory `/usr/src/server2/php4-STABLE-200206231500/sapi'
make: *** [install-recursive] Error 1


php configure line:
./configure \
        --prefix=/usr/server-test/ \
        --enable-bcmath \
        --enable-calendar \
        --enable-ftp \
        --enable-mbstring \
        --enable-sockets \
        --with-config-file-path=/usr/server-test/lib/ \
        --with-gd=/usr/local \
        --enable-gd-native-ttf \
        --with-jpeg-dir=/usr/lib \
        --with-png-dir=/usr/lib \
        --with-mysql=/usr \
        --with-openssl=/usr \
        --with-zlib=/usr \
        --with-apxs2=/usr/server-test/bin/apxs

if it can be of any help i can provide you with the whole compile log, just drop me a note!

Patches

Pull Requests

History

AllCommentsChangesGit/SVN commitsRelated reports
 [2002-06-23 18:25 UTC] derick@php.net
This bug has been fixed in CVS. You can grab a snapshot of the
CVS version at http://snaps.php.net/. In case this was a documentation 
problem, the fix will show up soon at http://www.php.net/manual/.
In case this was a PHP.net website problem, the change will show
up on the PHP.net site and on the mirror sites.
Thank you for the report, and for helping us make PHP better.

This was report Nr. 21 about this issue :) It's already fixed...

Derick
 [2002-06-23 18:28 UTC] mw at suk dot net
seems like it has not been fixed, just grabbed a snapshot ( php4-STABLE-200206231500) and still same problem ...
 [2002-06-23 18:29 UTC] mw at suk dot net
tried with the latest one also ... same error!
 [2002-06-23 18:29 UTC] derick@php.net
It's fixed now... (it was fixed in the DEV branch... but not merged to the stable one. I just did that so wait for the next snapshot).

Derick
 
PHP Copyright © 2001-2026 The PHP Group
All rights reserved.
Last updated: Thu Oct 08 15:00:02 2026 UTC