php.net |  support |  documentation |  report a bug |  advanced search |  search howto |  statistics |  random bug |  login
« Show Previous 30 Entries Showing 31-60 of 72 Show Next 30 Entries »
Bugs for Compile Failure
ID# Date Last Modified Type Status PHP Version OS Summary Assigned
69508
(edit)
2015-04-23 00:10 UTC Not modified Bug Open 5.6.8 Linux 2.6 When using INSTALL_ROOT, apxs is called to modify httpd.conf in the INSTALL_ROO  
69808
(edit)
2015-06-12 07:56 UTC Not modified Bug Open 5.6.10 Centos 7 5.6 BUILD FAILS: configure: error: Don't know how to define struct flock on thi  
71343
(edit)
2016-01-12 01:11 UTC 2016-06-04 01:15 UTC Bug Open Irrelevant OSX Build system tries to link with Xcode libs and link fails  
73804
(edit)
2016-12-22 19:56 UTC 2016-12-23 10:41 UTC Bug Open 7.1.0 OSX 10.11.6 Compilation of libphp7.so fails  
73009
(edit)
2016-09-03 20:34 UTC Not modified Bug Open 7.0.10 Ubuntu 16.04 Xenial Xerus dns.c error: storage size of 'state' isn't known  
73013
(edit)
2016-09-04 17:36 UTC Not modified Bug Open 7.1.0RC1 Ubuntu 16.04 Xenial Xerus Generating phar.phar during cross-compile can't be done  
73111
(edit)
2016-09-19 08:21 UTC 2016-10-03 16:10 UTC Doc Open 7.0.12 RC1 Linux make prof-use don't work -> still profiling code  
73564
(edit)
2016-11-19 00:45 UTC Not modified Bug Open 7.1.0RC6 Debian 8.3 cannot compile with ldap support  
73777
(edit)
2016-12-17 17:09 UTC 2017-01-25 22:38 UTC Bug Open 7.0.14 Solaris 10 Update 11 Undefined symbols during linking  
73996
(edit)
2017-01-25 16:14 UTC Not modified Bug Open 7.1.1 Solaris 11.3 gmake: *** [sapi/cli/php] Error 1  
74904
(edit)
2017-07-11 16:06 UTC 2018-10-23 16:06 UTC Bug Open 7.1.7 Solaris 11.3.21.5.0 (x86-64) zend_operators.h: Error: The function "isfinite" must have a prototype.  
75314
(edit)
2017-10-05 11:01 UTC 2017-11-29 19:12 UTC Bug Open 7.0Git-2017-10-05 (Git) Linux apache2handler configure error, httpd.conf not found  
75487
(edit)
2017-11-06 00:42 UTC 2017-11-10 03:03 UTC Bug Open 7.2.0RC5 Linux can't find res_ndestroy  
75512
(edit)
2017-11-12 17:53 UTC 2017-11-13 05:35 UTC Bug Open 7.1.11 embedded Linux 2.6.31.8 Compilation error on an ARMv5 NAS  
75582
(edit)
2017-11-27 17:27 UTC Not modified Bug Open master-Git-2017-11-27 (Git) OpenBSD 6.2 error: use of undeclared identifier 'IFF_BROADCAST'  
75695
(edit)
2017-12-15 23:57 UTC Not modified Bug Open 7.1.12 Linux (Fedora) LDAP & OpenSSL Libdir Compile Bug  
75941
(edit)
2018-02-08 23:58 UTC Not modified Bug Open 7.2.2 SunOS, Solaris, pkgsrc Fix compile failure on Solaris with clang  
76381
(edit)
2018-05-27 11:08 UTC 2018-05-28 07:32 UTC Bug Open 7.2.6 Ubuntu 16.04 Getting fatal error over some header files missing  
77446
(edit)
2019-01-11 13:44 UTC Not modified Bug Open 7.3.1 MacOS Trying to compile PHP with LDAP without using shared libs  
77748
(edit)
2019-03-15 16:52 UTC 2019-03-19 23:26 UTC Bug Open 7.3.3 macOS 10.14.3 ./configure fails to make  
77775
(edit)
2019-03-21 00:12 UTC 2019-03-22 03:46 UTC Bug Open 7.2.16 macOS 10.12.6 ext/intl/intl_convertcpp.cpp fails to buid  
78085
(edit)
2019-05-30 06:41 UTC 2019-05-30 17:45 UTC Bug Open Irrelevant mac os 10.14.4 configure: error: Cannot find php_pdo_driver.h.  
78097
(edit)
2019-06-02 09:46 UTC Not modified Bug Open 7.2.19 Debian 9 error The mailparse extension requires the mbstring extension  
78178
(edit)
2019-06-18 10:29 UTC 2019-06-18 10:50 UTC Bug Open 7.2.20RC1 AIX AIX specific cases missing in configure  
78899
(edit)
2019-12-02 13:03 UTC 2020-05-11 10:55 UTC Bug Open 7.4.0 centos6.9 gcc6.5 can't compile base64.c  
79654
(edit)
2020-05-30 09:44 UTC 2020-06-09 07:33 UTC Bug Open 7.4.6 solaris 11 improper member use in zend_inheritance.c  
79873
(edit)
2020-07-18 15:17 UTC Not modified Bug Open 8.0Git-2020-07-18 (Git) Linux mod_php: crashes with non-debug build  
79967
(edit)
2020-08-13 06:15 UTC 2020-08-13 07:52 UTC Bug Open 7.4.9 FreeBSD 11 "fcgi_request" makes building failed on freeBSD  
80386
(edit)
2020-11-20 10:07 UTC 2020-11-26 15:28 UTC Bug Open 8.0.0RC5 Centos 7 Configure with opcache enabled fails  
80403
(edit)
2020-11-23 03:42 UTC Not modified Bug Open 7.4.12 macos big sur old macos version is ok,but update to macos big sur later ,compile failure  
« Show Previous 30 Entries Showing 31-60 of 72 Show Next 30 Entries »
 
PHP Copyright © 2001-2021 The PHP Group
All rights reserved.
Last updated: Tue Mar 02 12:01:23 2021 UTC