php.net |  support |  documentation |  report a bug |  advanced search |  search howto |  statistics |  random bug |  login
Bug #76063 Fails to compile under PHP 7.2
Submitted: 2018-03-07 00:14 UTC Modified: -
Votes:12
Avg. Score:3.7 ± 0.7
Reproduced:11 of 11 (100.0%)
Same Version:9 (81.8%)
Same OS:5 (45.5%)
From: spam at binarymagi dot com Assigned:
Status: Open Package: uploadprogress (PECL)
PHP Version: 7.2.3 OS: CentOS 7
Private report: No CVE-ID: None
View Add Comment Developer Edit
Welcome! If you don't have a Git account, you can't do anything here.
You can add a comment by following this link or if you reported this bug, you can edit this bug over here.
Block user comment
Status: Assign to:
Package:
Bug Type:
Summary:
From: spam at binarymagi dot com
New email:
PHP Version: OS:

 

 [2018-03-07 00:14 UTC] spam at binarymagi dot com
Description:
------------
Module needs updating to be compatible with PHP 7.2

Actual result:
--------------
[root@blahbox ~]# /usr/local/php/7.2/bin/pecl install uploadprogress
downloading uploadprogress-1.0.3.1.tgz ...
Starting to download uploadprogress-1.0.3.1.tgz (9,040 bytes)
.....done: 9,040 bytes
4 source files, building
running: phpize
Configuring for:
PHP Api Version:         20170718
Zend Module Api No:      20170718
Zend Extension Api No:   320170718
building in /tmp/pear/temp/pear-build-rootuGYOIH/uploadprogress-1.0.3.1
running: /tmp/pear/temp/uploadprogress/configure --with-php-config=/usr/local/php/7.2/bin/php-config
checking for grep that handles long lines and -e... /usr/bin/grep
checking for egrep... /usr/bin/grep -E
checking for a sed that does not truncate output... /usr/bin/sed
checking for cc... cc
checking whether the C compiler works... yes
checking for C compiler default output file name... a.out
checking for suffix of executables...
checking whether we are cross compiling... no
checking for suffix of object files... o
checking whether we are using the GNU C compiler... yes
checking whether cc accepts -g... yes
checking for cc option to accept ISO C89... none needed
checking how to run the C preprocessor... cc -E
checking for icc... no
checking for suncc... no
checking whether cc understands -c and -o together... yes
checking for system library directory... lib
checking if compiler supports -R... no
checking if compiler supports -Wl,-rpath,... yes
checking build system type... x86_64-unknown-linux-gnu
checking host system type... x86_64-unknown-linux-gnu
checking target system type... x86_64-unknown-linux-gnu
checking for PHP prefix... /usr/local/php/7.2
checking for PHP includes... -I/usr/local/php/7.2/include/php -I/usr/local/php/7.2/include/php/main -I/usr/local/php/7.2/include/php/TSRM -I/usr/local/php/7.2/include/php/Zend -I/usr/local/php/7.2/include/php/ext -I/usr/local/php/7.2/include/php/ext/date/lib
checking for PHP extension directory... /usr/local/php/7.2/lib/php/20170718
checking for PHP installed headers prefix... /usr/local/php/7.2/include/php
checking if debug is enabled... no
checking if zts is enabled... no
checking for re2c... re2c
checking for re2c version... 0.14.3 (ok)
checking for gawk... gawk
checking whether to enable uploadprogress functions... yes, shared
checking for ld used by cc... /usr/bin/ld
checking if the linker (/usr/bin/ld) is GNU ld... yes
checking for /usr/bin/ld option to reload object files... -r
checking for BSD-compatible nm... /usr/bin/nm -B
checking whether ln -s works... yes
checking how to recognize dependent libraries... pass_all
checking for ANSI C header files... yes
checking for sys/types.h... yes
checking for sys/stat.h... yes
checking for stdlib.h... yes
checking for string.h... yes
checking for memory.h... yes
checking for strings.h... yes
checking for inttypes.h... yes
checking for stdint.h... yes
checking for unistd.h... yes
checking dlfcn.h usability... yes
checking dlfcn.h presence... yes
checking for dlfcn.h... yes
checking the maximum length of command line arguments... 1572864
checking command to parse /usr/bin/nm -B output from cc object... ok
checking for objdir... .libs
checking for ar... ar
checking for ranlib... ranlib
checking for strip... strip
checking if cc supports -fno-rtti -fno-exceptions... no
checking for cc option to produce PIC... -fPIC
checking if cc PIC flag -fPIC works... yes
checking if cc static flag -static works... no
checking if cc supports -c -o file.o... yes
checking whether the cc linker (/usr/bin/ld -m elf_x86_64) supports shared libraries... yes
checking whether -lc should be explicitly linked in... no
checking dynamic linker characteristics... GNU/Linux ld.so
checking how to hardcode library paths into programs... immediate
checking whether stripping libraries is possible... yes
checking if libtool supports shared libraries... yes
checking whether to build shared libraries... yes
checking whether to build static libraries... no

creating libtool
appending configuration tag "CXX" to libtool
configure: creating ./config.status
config.status: creating config.h
running: make
/bin/sh /tmp/pear/temp/pear-build-rootuGYOIH/uploadprogress-1.0.3.1/libtool --mode=compile cc  -I. -I/tmp/pear/temp/uploadprogress -DPHP_ATOM_INC -I/tmp/pear/temp/pear-build-rootuGYOIH/uploadprogress-1.0.3.1/include -I/tmp/pear/temp/pear-build-rootuGYOIH/uploadprogress-1.0.3.1/main -I/tmp/pear/temp/uploadprogress -I/usr/local/php/7.2/include/php -I/usr/local/php/7.2/include/php/main -I/usr/local/php/7.2/include/php/TSRM -I/usr/local/php/7.2/include/php/Zend -I/usr/local/php/7.2/include/php/ext -I/usr/local/php/7.2/include/php/ext/date/lib  -DHAVE_CONFIG_H  -g -O2   -c /tmp/pear/temp/uploadprogress/uploadprogress.c -o uploadprogress.lo
mkdir .libs
 cc -I. -I/tmp/pear/temp/uploadprogress -DPHP_ATOM_INC -I/tmp/pear/temp/pear-build-rootuGYOIH/uploadprogress-1.0.3.1/include -I/tmp/pear/temp/pear-build-rootuGYOIH/uploadprogress-1.0.3.1/main -I/tmp/pear/temp/uploadprogress -I/usr/local/php/7.2/include/php -I/usr/local/php/7.2/include/php/main -I/usr/local/php/7.2/include/php/TSRM -I/usr/local/php/7.2/include/php/Zend -I/usr/local/php/7.2/include/php/ext -I/usr/local/php/7.2/include/php/ext/date/lib -DHAVE_CONFIG_H -g -O2 -c /tmp/pear/temp/uploadprogress/uploadprogress.c  -fPIC -DPIC -o .libs/uploadprogress.o
/tmp/pear/temp/uploadprogress/uploadprogress.c: In function ‘uploadprogress_php_rfc1867_file’:
/tmp/pear/temp/uploadprogress/uploadprogress.c:160:31: error: ‘ENFORCE_SAFE_MODE’ undeclared (first use in this function)
                 int options = ENFORCE_SAFE_MODE;
                               ^
/tmp/pear/temp/uploadprogress/uploadprogress.c:160:31: note: each undeclared identifier is reported only once for each function it appears in
/tmp/pear/temp/uploadprogress/uploadprogress.c: In function ‘uploadprogress_file_php_get_info’:
/tmp/pear/temp/uploadprogress/uploadprogress.c:420:57: error: macro "add_assoc_string" passed 4 arguments, but takes just 3
                 add_assoc_string( return_value, k, v, 1 );
                                                         ^
/tmp/pear/temp/uploadprogress/uploadprogress.c:420:17: error: ‘add_assoc_string’ undeclared (first use in this function)
                 add_assoc_string( return_value, k, v, 1 );
                 ^
/tmp/pear/temp/uploadprogress/uploadprogress.c: In function ‘uploadprogress_file_php_get_contents’:
/tmp/pear/temp/uploadprogress/uploadprogress.c:437:19: error: ‘ENFORCE_SAFE_MODE’ undeclared (first use in this function)
     int options = ENFORCE_SAFE_MODE;
                   ^
/tmp/pear/temp/uploadprogress/uploadprogress.c:458:71: error: macro "php_stream_copy_to_mem" passed 4 arguments, but takes just 3
         if ((len = php_stream_copy_to_mem(stream, &contents, maxlen, 0)) > 0) {
                                                                       ^
/tmp/pear/temp/uploadprogress/uploadprogress.c:458:20: error: ‘php_stream_copy_to_mem’ undeclared (first use in this function)
         if ((len = php_stream_copy_to_mem(stream, &contents, maxlen, 0)) > 0) {
                    ^
/tmp/pear/temp/uploadprogress/uploadprogress.c:466:44: error: macro "RETVAL_STRINGL" passed 3 arguments, but takes just 2
             RETVAL_STRINGL(contents, len, 0);
                                            ^
/tmp/pear/temp/uploadprogress/uploadprogress.c:466:13: error: ‘RETVAL_STRINGL’ undeclared (first use in this function)
             RETVAL_STRINGL(contents, len, 0);
             ^
make: *** [uploadprogress.lo] Error 1
ERROR: `make' failed

Patches

Add a Patch

Pull Requests

Add a Pull Request

History

AllCommentsChangesGit/SVN commitsRelated reports
 [2018-11-26 13:54 UTC] luca dot orlandi at gmail dot com
Same for Ubuntu 16.04.5 LTS 
PHP 7.0.32

php-dev package installed
 [2018-11-26 13:56 UTC] luca dot orlandi at gmail dot com
See https://bugs.php.net/bug.php?id=69810
 
PHP Copyright © 2001-2019 The PHP Group
All rights reserved.
Last updated: Fri Sep 20 01:01:28 2019 UTC