php.net |  support |  documentation |  report a bug |  advanced search |  search howto |  statistics |  random bug |  login
Bug #72387 Make problem
Submitted: 2016-06-12 03:44 UTC Modified: 2020-01-27 16:21 UTC
From: me at arsen dot pw Assigned: cmb (profile)
Status: Duplicate Package: uploadprogress (PECL)
PHP Version: 7.0.7 OS: Amazon Linux AMI 2016.03
Private report: No CVE-ID: None
View Add Comment Developer Edit
Welcome! If you don't have a Git account, you can't do anything here.
You can add a comment by following this link or if you reported this bug, you can edit this bug over here.
Block user comment
Status: Assign to:
Package:
Bug Type:
Summary:
From: me at arsen dot pw
New email:
PHP Version: OS:

 

 [2016-06-12 03:44 UTC] me at arsen dot pw
Description:
------------
# make
/bin/sh /usr/src/uploadprogress-1.0.3.1/libtool --mode=compile cc  -I. -I/usr/src/uploadprogress-1.0.3.1 -DPHP_ATOM_INC -I/usr/src/uploadprogress-1.0.3.1/include -I/usr/src/uploadprogress-1.0.3.1/main -I/usr/src/uploadprogress-1.0.3.1 -I/usr/include/php -I/usr/include/php/main -I/usr/include/php/TSRM -I/usr/include/php/Zend -I/usr/include/php/ext -I/usr/include/php/ext/date/lib  -DHAVE_CONFIG_H  -g -O2   -c /usr/src/uploadprogress-1.0.3.1/uploadprogress.c -o uploadprogress.lo
libtool: compile:  cc -I. -I/usr/src/uploadprogress-1.0.3.1 -DPHP_ATOM_INC -I/usr/src/uploadprogress-1.0.3.1/include -I/usr/src/uploadprogress-1.0.3.1/main -I/usr/src/uploadprogress-1.0.3.1 -I/usr/include/php -I/usr/include/php/main -I/usr/include/php/TSRM -I/usr/include/php/Zend -I/usr/include/php/ext -I/usr/include/php/ext/date/lib -DHAVE_CONFIG_H -g -O2 -c /usr/src/uploadprogress-1.0.3.1/uploadprogress.c  -fPIC -DPIC -o .libs/uploadprogress.o
/usr/src/uploadprogress-1.0.3.1/uploadprogress.c: In function ‘uploadprogress_php_rfc1867_file’:
/usr/src/uploadprogress-1.0.3.1/uploadprogress.c:160:31: error: ‘ENFORCE_SAFE_MODE’ undeclared (first use in this function)
                 int options = ENFORCE_SAFE_MODE;
                               ^
/usr/src/uploadprogress-1.0.3.1/uploadprogress.c:160:31: note: each undeclared identifier is reported only once for each function it appears in
/usr/src/uploadprogress-1.0.3.1/uploadprogress.c: In function ‘uploadprogress_file_php_get_info’:
/usr/src/uploadprogress-1.0.3.1/uploadprogress.c:420:57: error: macro "add_assoc_string" passed 4 arguments, but takes just 3
                 add_assoc_string( return_value, k, v, 1 );
                                                         ^
/usr/src/uploadprogress-1.0.3.1/uploadprogress.c:420:17: error: ‘add_assoc_string’ undeclared (first use in this function)
                 add_assoc_string( return_value, k, v, 1 );
                 ^
/usr/src/uploadprogress-1.0.3.1/uploadprogress.c: In function ‘uploadprogress_file_php_get_contents’:
/usr/src/uploadprogress-1.0.3.1/uploadprogress.c:437:19: error: ‘ENFORCE_SAFE_MODE’ undeclared (first use in this function)
     int options = ENFORCE_SAFE_MODE;
                   ^
/usr/src/uploadprogress-1.0.3.1/uploadprogress.c:458:71: error: macro "php_stream_copy_to_mem" passed 4 arguments, but takes just 3
         if ((len = php_stream_copy_to_mem(stream, &contents, maxlen, 0)) > 0) {
                                                                       ^
/usr/src/uploadprogress-1.0.3.1/uploadprogress.c:458:20: error: ‘php_stream_copy_to_mem’ undeclared (first use in this function)
         if ((len = php_stream_copy_to_mem(stream, &contents, maxlen, 0)) > 0) {
                    ^
/usr/src/uploadprogress-1.0.3.1/uploadprogress.c:466:44: error: macro "RETVAL_STRINGL" passed 3 arguments, but takes just 2
             RETVAL_STRINGL(contents, len, 0);
                                            ^
/usr/src/uploadprogress-1.0.3.1/uploadprogress.c:466:13: error: ‘RETVAL_STRINGL’ undeclared (first use in this function)
             RETVAL_STRINGL(contents, len, 0);
             ^
make: *** [uploadprogress.lo] Error 1


Patches

Add a Patch

Pull Requests

Add a Pull Request

History

AllCommentsChangesGit/SVN commitsRelated reports
 [2016-06-12 10:16 UTC] cmb@php.net
-Status: Open +Status: Duplicate -Assigned To: +Assigned To: cmb
 [2016-06-12 10:16 UTC] cmb@php.net
Duplicate of request #69242.
 [2016-10-31 21:28 UTC] ttbek0 at gmail dot com
Confirmed on Ubuntu 16.04 as well with PHP 7.0.8

sudo apt-get install php7.0-dev
All is good
sudo apt-get install php-pear
All is good
sudo pecl -Z install uploadprogress
Fails when running make:
downloading uploadprogress-1.0.3.1.tar ...
Starting to download uploadprogress-1.0.3.1.tar (42,496 bytes)
............done: 42,496 bytes
4 source files, building
running: phpize
Configuring for:
PHP Api Version:         20151012
Zend Module Api No:      20151012
Zend Extension Api No:   320151012
building in /tmp/pear/temp/pear-build-rootLnIjYx/uploadprogress-1.0.3.1
running: /tmp/pear/temp/uploadprogress/configure --with-php-config=/usr/bin/php-config
checking for grep that handles long lines and -e... /bin/grep
checking for egrep... /bin/grep -E
checking for a sed that does not truncate output... /bin/sed
checking for cc... cc
checking whether the C compiler works... yes
checking for C compiler default output file name... a.out
checking for suffix of executables...
checking whether we are cross compiling... no
checking for suffix of object files... o
checking whether we are using the GNU C compiler... yes
checking whether cc accepts -g... yes
checking for cc option to accept ISO C89... none needed
checking how to run the C preprocessor... cc -E
checking for icc... no
checking for suncc... no
checking whether cc understands -c and -o together... yes
checking for system library directory... lib
checking if compiler supports -R... no
checking if compiler supports -Wl,-rpath,... yes
checking build system type... x86_64-pc-linux-gnu
checking host system type... x86_64-pc-linux-gnu
checking target system type... x86_64-pc-linux-gnu
checking for PHP prefix... /usr
checking for PHP includes... -I/usr/include/php/20151012 -I/usr/include/php/20151012/main -I/usr/include/php/20151012/TSRM -I/usr/include/php/20151012/Zend -I/usr/include/php/20151012/ext -I/usr/include/php/20151012/ext/date/lib
checking for PHP extension directory... /usr/lib/php/20151012
checking for PHP installed headers prefix... /usr/include/php/20151012
checking if debug is enabled... no
checking if zts is enabled... no
checking for re2c... no
configure: WARNING: You will need re2c 0.13.4 or later if you want to regenerate PHP parsers.
checking for gawk... gawk
checking whether to enable uploadprogress functions... yes, shared
checking how to print strings... printf
checking for a sed that does not truncate output... (cached) /bin/sed
checking for fgrep... /bin/grep -F
checking for ld used by cc... /usr/bin/ld
checking if the linker (/usr/bin/ld) is GNU ld... yes
checking for BSD- or MS-compatible name lister (nm)... /usr/bin/nm -B
checking the name lister (/usr/bin/nm -B) interface... BSD nm
checking whether ln -s works... yes
checking the maximum length of command line arguments... 1572864
checking how to convert x86_64-pc-linux-gnu file names to x86_64-pc-linux-gnu format... func_convert_file_noop
checking how to convert x86_64-pc-linux-gnu file names to toolchain format... func_convert_file_noop
checking for /usr/bin/ld option to reload object files... -r
checking for objdump... objdump
checking how to recognize dependent libraries... pass_all
checking for dlltool... no
checking how to associate runtime and link libraries... printf %s\n
checking for ar... ar
checking for archiver @FILE support... @
checking for strip... strip
checking for ranlib... ranlib
checking for gawk... (cached) gawk
checking command to parse /usr/bin/nm -B output from cc object... ok
checking for sysroot... no
checking for a working dd... /bin/dd
checking how to truncate binary pipes... /bin/dd bs=4096 count=1
checking for mt... mt
checking if mt is a manifest tool... no
checking for ANSI C header files... yes
checking for sys/types.h... yes
checking for sys/stat.h... yes
checking for stdlib.h... yes
checking for string.h... yes
checking for memory.h... yes
checking for strings.h... yes
checking for inttypes.h... yes
checking for stdint.h... yes
checking for unistd.h... yes
checking for dlfcn.h... yes
checking for objdir... .libs
checking if cc supports -fno-rtti -fno-exceptions... no
checking for cc option to produce PIC... -fPIC -DPIC
checking if cc PIC flag -fPIC -DPIC works... yes
checking if cc static flag -static works... yes
checking if cc supports -c -o file.o... yes
checking if cc supports -c -o file.o... (cached) yes
checking whether the cc linker (/usr/bin/ld -m elf_x86_64) supports shared libraries... yes
checking whether -lc should be explicitly linked in... no
checking dynamic linker characteristics... GNU/Linux ld.so
checking how to hardcode library paths into programs... immediate
checking whether stripping libraries is possible... yes
checking if libtool supports shared libraries... yes
checking whether to build shared libraries... yes
checking whether to build static libraries... no
configure: creating ./config.status
config.status: creating config.h
config.status: executing libtool commands
running: make
/bin/bash /tmp/pear/temp/pear-build-rootLnIjYx/uploadprogress-1.0.3.1/libtool --mode=compile cc  -I. -I/tmp/pear/temp/uploadprogress -DPHP_ATOM_INC -I/tmp/pear/temp/pear-build-rootLnIjYx/uploadprogress-1.0.3.1/include -I/tmp/pear/temp/pear-build-rootLnIjYx/uploadprogress-1.0.3.1/main -I/tmp/pear/temp/uploadprogress -I/usr/include/php/20151012 -I/usr/include/php/20151012/main -I/usr/include/php/20151012/TSRM -I/usr/include/php/20151012/Zend -I/usr/include/php/20151012/ext -I/usr/include/php/20151012/ext/date/lib  -DHAVE_CONFIG_H  -g -O2   -c /tmp/pear/temp/uploadprogress/uploadprogress.c -o uploadprogress.lo
libtool: compile:  cc -I. -I/tmp/pear/temp/uploadprogress -DPHP_ATOM_INC -I/tmp/pear/temp/pear-build-rootLnIjYx/uploadprogress-1.0.3.1/include -I/tmp/pear/temp/pear-build-rootLnIjYx/uploadprogress-1.0.3.1/main -I/tmp/pear/temp/uploadprogress -I/usr/include/php/20151012 -I/usr/include/php/20151012/main -I/usr/include/php/20151012/TSRM -I/usr/include/php/20151012/Zend -I/usr/include/php/20151012/ext -I/usr/include/php/20151012/ext/date/lib -DHAVE_CONFIG_H -g -O2 -c /tmp/pear/temp/uploadprogress/uploadprogress.c  -fPIC -DPIC -o .libs/uploadprogress.o
/tmp/pear/temp/uploadprogress/uploadprogress.c: In function ‘uploadprogress_php_rfc1867_file’:
/tmp/pear/temp/uploadprogress/uploadprogress.c:160:31: error: ‘ENFORCE_SAFE_MODE’ undeclared (first use in this function)
                 int options = ENFORCE_SAFE_MODE;
                               ^
/tmp/pear/temp/uploadprogress/uploadprogress.c:160:31: note: each undeclared identifier is reported only once for each function it appears in
/tmp/pear/temp/uploadprogress/uploadprogress.c:216:28: warning: format ‘%d’ expects argument of type ‘int’, but argument 6 has type ‘time_t {aka long int}’ [-Wformat=]
                 fprintf(F, "upload_id=%s\nfieldname=%s\nfilename=%s\ntime_start=%d\ntime_last=%d\nspeed_average=%d\nspeed_last=%d\nbytes_uploaded=%d\nbytes_total=%d\nfiles_uploaded=%d\nest_sec=%d\n",
                            ^
/tmp/pear/temp/uploadprogress/uploadprogress.c:216:28: warning: format ‘%d’ expects argument of type ‘int’, but argument 7 has type ‘time_t {aka long int}’ [-Wformat=]
/tmp/pear/temp/uploadprogress/uploadprogress.c:216:28: warning: format ‘%d’ expects argument of type ‘int’, but argument 10 has type ‘long unsigned int’ [-Wformat=]
/tmp/pear/temp/uploadprogress/uploadprogress.c:216:28: warning: format ‘%d’ expects argument of type ‘int’, but argument 11 has type ‘long unsigned int’ [-Wformat=]
/tmp/pear/temp/uploadprogress/uploadprogress.c: In function ‘uploadprogress_file_php_get_info’:
/tmp/pear/temp/uploadprogress/uploadprogress.c:420:57: error: macro "add_assoc_string" passed 4 arguments, but takes just 3
                 add_assoc_string( return_value, k, v, 1 );
                                                         ^
/tmp/pear/temp/uploadprogress/uploadprogress.c:420:17: error: ‘add_assoc_string’ undeclared (first use in this function)
                 add_assoc_string( return_value, k, v, 1 );
                 ^
/tmp/pear/temp/uploadprogress/uploadprogress.c: In function ‘uploadprogress_file_php_get_contents’:
/tmp/pear/temp/uploadprogress/uploadprogress.c:437:19: error: ‘ENFORCE_SAFE_MODE’ undeclared (first use in this function)
     int options = ENFORCE_SAFE_MODE;
                   ^
/tmp/pear/temp/uploadprogress/uploadprogress.c:458:71: error: macro "php_stream_copy_to_mem" passed 4 arguments, but takes just 3
         if ((len = php_stream_copy_to_mem(stream, &contents, maxlen, 0)) > 0) {
                                                                       ^
/tmp/pear/temp/uploadprogress/uploadprogress.c:458:20: error: ‘php_stream_copy_to_mem’ undeclared (first use in this function)
         if ((len = php_stream_copy_to_mem(stream, &contents, maxlen, 0)) > 0) {
                    ^
/tmp/pear/temp/uploadprogress/uploadprogress.c:466:44: error: macro "RETVAL_STRINGL" passed 3 arguments, but takes just 2
             RETVAL_STRINGL(contents, len, 0);
                                            ^
/tmp/pear/temp/uploadprogress/uploadprogress.c:466:13: error: ‘RETVAL_STRINGL’ undeclared (first use in this function)
             RETVAL_STRINGL(contents, len, 0);
             ^
Makefile:194: recipe for target 'uploadprogress.lo' failed
make: *** [uploadprogress.lo] Error 1
ERROR: `make' failed
 [2017-01-04 00:22 UTC] lupa at tedic dot org
Please, can someone take a look at this?

Thanks in advance !!
 [2017-09-21 11:30 UTC] yasheshb at venuslabs dot co dot in
same problem on Fedora Core 26

php-cli-7.1.9-2.fc26.x86_64
php-pear-1.10.5-2.fc26.noarch
 [2020-01-27 16:21 UTC] ramsey@php.net
PHP 7 (and 8) support is now implemented in uploadprogress. Please upgrade to version 1.1.2 or later.
 
PHP Copyright © 2001-2021 The PHP Group
All rights reserved.
Last updated: Tue Sep 21 11:03:38 2021 UTC