php.net |  support |  documentation |  report a bug |  advanced search |  search howto |  statistics |  random bug |  login
Bug #65731 make error
Submitted: 2013-09-21 11:15 UTC Modified: 2013-09-21 14:38 UTC
Votes:12
Avg. Score:4.0 ± 1.3
Reproduced:12 of 12 (100.0%)
Same Version:8 (66.7%)
Same OS:3 (25.0%)
From: orti1980 at gmail dot com Assigned:
Status: Suspended Package: APC (PECL)
PHP Version: 5.5.4 OS: fedora 20
Private report: No CVE-ID: None
View Add Comment Developer Edit
Welcome! If you don't have a Git account, you can't do anything here.
You can add a comment by following this link or if you reported this bug, you can edit this bug over here.
Block user comment
Status: Assign to:
Package:
Bug Type:
Summary:
From: orti1980 at gmail dot com
New email:
PHP Version: OS:

 

 [2013-09-21 11:15 UTC] orti1980 at gmail dot com
Description:
------------
/var/tmp/APC/apc_compile.c: In function 'my_copy_class_entry':
/var/tmp/APC/apc_compile.c:755:38: warning: assignment from incompatible pointer type [enabled by default]
         CHECK(dst->trait_precedences =
                                      ^
/var/tmp/APC/apc_compile.c:47:25: note: in definition of macro 'CHECK'
 #define CHECK(p) { if ((p) == NULL) return NULL; }
                         ^
/var/tmp/APC/apc_compile.c: In function 'apc_copy_class_entry_for_execution':
/var/tmp/APC/apc_compile.c:1956:38: warning: assignment from incompatible pointer type [enabled by default]
         CHECK(dst->trait_precedences =
                                      ^
/var/tmp/APC/apc_compile.c:47:25: note: in definition of macro 'CHECK'
 #define CHECK(p) { if ((p) == NULL) return NULL; }
                         ^
/var/tmp/APC/apc_compile.c: In function 'apc_copy_trait_alias':
/var/tmp/APC/apc_compile.c:2379:12: error: 'zend_trait_alias' has no member named 'function'
     if (src->function) {
            ^
/var/tmp/APC/apc_compile.c:2380:18: error: 'zend_trait_alias' has no member named 'function'
         CHECK(dst->function = my_copy_function(NULL, src->function, ctxt TSRMLS_CC));
                  ^
/var/tmp/APC/apc_compile.c:47:25: note: in definition of macro 'CHECK'
 #define CHECK(p) { if ((p) == NULL) return NULL; }
                         ^
/var/tmp/APC/apc_compile.c:2380:57: error: 'zend_trait_alias' has no member named 'function'
         CHECK(dst->function = my_copy_function(NULL, src->function, ctxt TSRMLS_CC));
                                                         ^
/var/tmp/APC/apc_compile.c:47:25: note: in definition of macro 'CHECK'
 #define CHECK(p) { if ((p) == NULL) return NULL; }
                         ^
/var/tmp/APC/apc_compile.c: In function 'apc_copy_trait_precedence':
/var/tmp/APC/apc_compile.c:2416:12: error: 'zend_trait_precedence' has no member named 'function'
     if (src->function) {
            ^
/var/tmp/APC/apc_compile.c:2417:18: error: 'zend_trait_precedence' has no member named 'function'
         CHECK(dst->function = my_copy_function(NULL, src->function, ctxt TSRMLS_CC));
                  ^
/var/tmp/APC/apc_compile.c:47:25: note: in definition of macro 'CHECK'
 #define CHECK(p) { if ((p) == NULL) return NULL; }
                         ^
/var/tmp/APC/apc_compile.c:2417:57: error: 'zend_trait_precedence' has no member named 'function'
         CHECK(dst->function = my_copy_function(NULL, src->function, ctxt TSRMLS_CC));
                                                         ^
/var/tmp/APC/apc_compile.c:47:25: note: in definition of macro 'CHECK'
 #define CHECK(p) { if ((p) == NULL) return NULL; }
                         ^
make: *** [apc_compile.lo] Fehler 1
ERROR: `make' failed

make-3.82-19.fc20.x86_64 installed


Patches

Add a Patch

Pull Requests

Add a Pull Request

History

AllCommentsChangesGit/SVN commitsRelated reports
 [2013-09-21 14:38 UTC] rasmus@php.net
-Status: Open +Status: Suspended
 [2013-09-21 14:38 UTC] rasmus@php.net
APC doesn't support PHP 5.5. PHP 5.5 comes bundled with an opcode cache now.
 
PHP Copyright © 2001-2019 The PHP Group
All rights reserved.
Last updated: Fri Nov 15 04:01:34 2019 UTC