|  support |  documentation |  report a bug |  advanced search |  search howto |  statistics |  random bug |  login
Bug #61983 radius.c fails to compile under gcc 4.4
Submitted: 2012-05-09 14:34 UTC Modified: 2012-05-10 01:19 UTC
From: josh dot campbell at acsn dot co dot uk Assigned:
Status: Not a bug Package: radius (PECL)
PHP Version: 5.4.3 OS: CentOS 6.2
Private report: No CVE-ID: None
View Add Comment Developer Edit
Anyone can comment on a bug. Have a simpler test case? Does it work for you on a different platform? Let us know!
Just going to say 'Me too!'? Don't clutter the database with that please !
Your email address:
Solve the problem:
10 + 28 = ?
Subscribe to this entry?

 [2012-05-09 14:34 UTC] josh dot campbell at acsn dot co dot uk
/root/radius-1.2.5/radius.c:65: error: expected â=â, â,â, â;â, âasmâ or 
â__attribute__â before âradius_functionsâ

/root/radius-1.2.5/radius.c:102: error: âradius_functionsâ undeclared here (not in 
a function)

make: *** [radius.lo] Error 1

Test script:


Add a Patch

Pull Requests

Add a Pull Request


AllCommentsChangesGit/SVN commitsRelated reports
 [2012-05-09 15:22 UTC] josh dot campbell at acsn dot co dot uk

diff radius.c radius.jas 
< function_entry radius_functions[] = {
> static zend_function_entry radius_functions[] = {
 [2012-05-10 01:19 UTC]
-Status: Open +Status: Not a bug
 [2012-05-10 01:19 UTC]
Try the SVN version, because a fix has been already committed, but no release done.
PHP Copyright © 2001-2023 The PHP Group
All rights reserved.
Last updated: Sat Dec 09 14:01:28 2023 UTC