php.net |  support |  documentation |  report a bug |  advanced search |  search howto |  statistics |  random bug |  login
Bug #61189 Runkit does not compatible with PHP 5.4.
Submitted: 2012-02-26 18:03 UTC Modified: 2012-08-28 01:46 UTC
Votes:8
Avg. Score:4.6 ± 0.5
Reproduced:6 of 6 (100.0%)
Same Version:4 (66.7%)
Same OS:6 (100.0%)
From: pahan at hubbitus dot info Assigned: dzenovich (profile)
Status: Closed Package: runkit (PECL)
PHP Version: 5.4.0RC8 OS: Linux
Private report: No CVE-ID: None
 [2012-02-26 18:03 UTC] pahan at hubbitus dot info
Description:
------------
+ make
/bin/sh /home/fedora/hubbitus/rpmbuild/BUILD/php-pecl-runkit-0.9/runkit/libtool 
--mode=compile cc  -I. -I/home/fedora/hubbitus/rpmbuild/BUILD/php-pecl-runkit-
0.9/runkit -DPHP_ATOM_INC -I/home/fedora/hubbitus/rpmbuild/BUILD/php-pecl-
runkit-0.9/runkit/include -I/home/fedora/hubbitus/rpmbuild/BUILD/php-pecl-
runkit-0.9/runkit/main -I/home/fedora/hubbitus/rpmbuild/BUILD/php-pecl-runkit-
0.9/runkit -I/usr/include/php -I/usr/include/php/main -I/usr/include/php/TSRM -
I/usr/include/php/Zend -I/usr/include/php/ext -I/usr/include/php/ext/date/lib  -
DHAVE_CONFIG_H  -O2 -g -pipe -Wall -Wp,-D_FORTIFY_SOURCE=2 -fexceptions -fstack-
protector --param=ssp-buffer-size=4 -m64 -mtune=generic   -c 
/home/fedora/hubbitus/rpmbuild/BUILD/php-pecl-runkit-0.9/runkit/runkit.c -o 
runkit.lo 
libtool: compile:  cc -I. -I/home/fedora/hubbitus/rpmbuild/BUILD/php-pecl-
runkit-0.9/runkit -DPHP_ATOM_INC -I/home/fedora/hubbitus/rpmbuild/BUILD/php-
pecl-runkit-0.9/runkit/include -I/home/fedora/hubbitus/rpmbuild/BUILD/php-pecl-
runkit-0.9/runkit/main -I/home/fedora/hubbitus/rpmbuild/BUILD/php-pecl-runkit-
0.9/runkit -I/usr/include/php -I/usr/include/php/main -I/usr/include/php/TSRM -
I/usr/include/php/Zend -I/usr/include/php/ext -I/usr/include/php/ext/date/lib -
DHAVE_CONFIG_H -O2 -g -pipe -Wall -Wp,-D_FORTIFY_SOURCE=2 -fexceptions -fstack-
protector --param=ssp-buffer-size=4 -m64 -mtune=generic -c 
/home/fedora/hubbitus/rpmbuild/BUILD/php-pecl-runkit-0.9/runkit/runkit.c  -fPIC 
-DPIC -o .libs/runkit.o
/home/fedora/hubbitus/rpmbuild/BUILD/php-pecl-runkit-0.9/runkit/runkit.c: In 
function 'zif_runkit_superglobals':
/home/fedora/hubbitus/rpmbuild/BUILD/php-pecl-runkit-0.9/runkit/runkit.c:36:3: 
warning: pointer targets in passing argument 3 of 'zend_hash_get_current_key_ex' 
differ in signedness [-Wpointer-sign]
In file included from /usr/include/php/Zend/zend.h:271:0,
                 from /usr/include/php/main/php.h:34,
                 from /home/fedora/hubbitus/rpmbuild/BUILD/php-pecl-runkit-
0.9/runkit/php_runkit.h:28,
                 from /home/fedora/hubbitus/rpmbuild/BUILD/php-pecl-runkit-
0.9/runkit/runkit.c:21:
/usr/include/php/Zend/zend_hash.h:179:45: note: expected 'uint *' but argument 
is of type 'int *'
/home/fedora/hubbitus/rpmbuild/BUILD/php-pecl-runkit-0.9/runkit/runkit.c:36:3: 
warning: pointer targets in passing argument 4 of 'zend_hash_get_current_key_ex' 
differ in signedness [-Wpointer-sign]
In file included from /usr/include/php/Zend/zend.h:271:0,
                 from /usr/include/php/main/php.h:34,
                 from /home/fedora/hubbitus/rpmbuild/BUILD/php-pecl-runkit-
0.9/runkit/php_runkit.h:28,
                 from /home/fedora/hubbitus/rpmbuild/BUILD/php-pecl-runkit-
0.9/runkit/runkit.c:21:
/usr/include/php/Zend/zend_hash.h:179:45: note: expected 'ulong *' but argument 
is of type 'long int *'
/home/fedora/hubbitus/rpmbuild/BUILD/php-pecl-runkit-0.9/runkit/runkit.c: At top 
level:
/home/fedora/hubbitus/rpmbuild/BUILD/php-pecl-runkit-0.9/runkit/runkit.c:77:1: 
error: unknown type name 'function_entry'
/home/fedora/hubbitus/rpmbuild/BUILD/php-pecl-runkit-0.9/runkit/runkit.c:79:2: 
warning: braces around scalar initializer [enabled by default]
/home/fedora/hubbitus/rpmbuild/BUILD/php-pecl-runkit-0.9/runkit/runkit.c:79:2: 
warning: (near initialization for 'runkit_functions[0]') [enabled by default]
/home/fedora/hubbitus/rpmbuild/BUILD/php-pecl-runkit-0.9/runkit/runkit.c:79:2: 
warning: initialization makes integer from pointer without a cast [enabled by 
default]
/home/fedora/hubbitus/rpmbuild/BUILD/php-pecl-runkit-0.9/runkit/runkit.c:79:2: 
warning: (near initialization for 'runkit_functions[0]') [enabled by default]
/home/fedora/hubbitus/rpmbuild/BUILD/php-pecl-runkit-0.9/runkit/runkit.c:79:2: 
error: initializer element is not computable at load time
/home/fedora/hubbitus/rpmbuild/BUILD/php-pecl-runkit-0.9/runkit/runkit.c:79:2: 
error: (near initialization for 'runkit_functions[0]')
/home/fedora/hubbitus/rpmbuild/BUILD/php-pecl-runkit-0.9/runkit/runkit.c:79:2: 
warning: excess elements in scalar initializer [enabled by default]
/home/fedora/hubbitus/rpmbuild/BUILD/php-pecl-runkit-0.9/runkit/runkit.c:79:2: 
warning: (near initialization for 'runkit_functions[0]') [enabled by default]
/home/fedora/hubbitus/rpmbuild/BUILD/php-pecl-runkit-0.9/runkit/runkit.c:79:2: 
warning: excess elements in scalar initializer [enabled by default]
/home/fedora/hubbitus/rpmbuild/BUILD/php-pecl-runkit-0.9/runkit/runkit.c:79:2: 
warning: (near initialization for 'runkit_functions[0]') [enabled by default]
/home/fedora/hubbitus/rpmbuild/BUILD/php-pecl-runkit-0.9/runkit/runkit.c:79:112: 
warning: excess elements in scalar initializer [enabled by default]
/home/fedora/hubbitus/rpmbuild/BUILD/php-pecl-runkit-0.9/runkit/runkit.c:79:112: 
warning: (near initialization for 'runkit_functions[0]') [enabled by default]
/home/fedora/hubbitus/rpmbuild/BUILD/php-pecl-runkit-0.9/runkit/runkit.c:79:112: 
warning: excess elements in scalar initializer [enabled by default]
/home/fedora/hubbitus/rpmbuild/BUILD/php-pecl-runkit-0.9/runkit/runkit.c:79:112: 
warning: (near initialization for 'runkit_functions[0]') [enabled by default]
/home/fedora/hubbitus/rpmbuild/BUILD/php-pecl-runkit-0.9/runkit/runkit.c:81:2: 
warning: braces around scalar initializer [enabled by default]
/home/fedora/hubbitus/rpmbuild/BUILD/php-pecl-runkit-0.9/runkit/runkit.c:81:2: 
warning: (near initialization for 'runkit_functions[1]') [enabled by default]
/home/fedora/hubbitus/rpmbuild/BUILD/php-pecl-runkit-0.9/runkit/runkit.c:81:2: 
warning: initialization makes integer from pointer without a cast [enabled by 
default]
/home/fedora/hubbitus/rpmbuild/BUILD/php-pecl-runkit-0.9/runkit/runkit.c:81:2: 
warning: (near initialization for 'runkit_functions[1]') [enabled by default]
/home/fedora/hubbitus/rpmbuild/BUILD/php-pecl-runkit-0.9/runkit/runkit.c:81:2: 
error: initializer element is not computable at load time
/home/fedora/hubbitus/rpmbuild/BUILD/php-pecl-runkit-0.9/runkit/runkit.c:81:2: 
error: (near initialization for 'runkit_functions[1]')
/home/fedora/hubbitus/rpmbuild/BUILD/php-pecl-runkit-0.9/runkit/runkit.c:81:2: 
warning: excess elements in scalar initializer [enabled by default]
/home/fedora/hubbitus/rpmbuild/BUILD/php-pecl-runkit-0.9/runkit/runkit.c:81:2: 
warning: (near initialization for 'runkit_functions[1]') [enabled by default]
/home/fedora/hubbitus/rpmbuild/BUILD/php-pecl-runkit-0.9/runkit/runkit.c:81:2: 
warning: excess elements in scalar initializer [enabled by default]
/home/fedora/hubbitus/rpmbuild/BUILD/php-pecl-runkit-0.9/runkit/runkit.c:81:2: 
warning: (near initialization for 'runkit_functions[1]') [enabled by default]
/home/fedora/hubbitus/rpmbuild/BUILD/php-pecl-runkit-0.9/runkit/runkit.c:81:106: 
warning: excess elements in scalar initializer [enabled by default]
/home/fedora/hubbitus/rpmbuild/BUILD/php-pecl-runkit-0.9/runkit/runkit.c:81:106: 
warning: (near initialization for 'runkit_functions[1]') [enabled by default]
/home/fedora/hubbitus/rpmbuild/BUILD/php-pecl-runkit-0.9/runkit/runkit.c:81:106: 
warning: excess elements in scalar initializer [enabled by default]
/home/fedora/hubbitus/rpmbuild/BUILD/php-pecl-runkit-0.9/runkit/runkit.c:81:106: 
warning: (near initialization for 'runkit_functions[1]') [enabled by default]
/home/fedora/hubbitus/rpmbuild/BUILD/php-pecl-runkit-0.9/runkit/runkit.c:83:2: 
warning: braces around scalar initializer [enabled by default]
/home/fedora/hubbitus/rpmbuild/BUILD/php-pecl-runkit-0.9/runkit/runkit.c:83:2: 
warning: (near initialization for 'runkit_functions[2]') [enabled by default]
/home/fedora/hubbitus/rpmbuild/BUILD/php-pecl-runkit-0.9/runkit/runkit.c:83:2: 
warning: initialization makes integer from pointer without a cast [enabled by 
default]
/home/fedora/hubbitus/rpmbuild/BUILD/php-pecl-runkit-0.9/runkit/runkit.c:83:2: 
warning: (near initialization for 'runkit_functions[2]') [enabled by default]
/home/fedora/hubbitus/rpmbuild/BUILD/php-pecl-runkit-0.9/runkit/runkit.c:83:2: 
error: initializer element is not computable at load time
/home/fedora/hubbitus/rpmbuild/BUILD/php-pecl-runkit-0.9/runkit/runkit.c:83:2: 
error: (near initialization for 'runkit_functions[2]')
/home/fedora/hubbitus/rpmbuild/BUILD/php-pecl-runkit-0.9/runkit/runkit.c:83:2: 
warning: excess elements in scalar initializer [enabled by default]
/home/fedora/hubbitus/rpmbuild/BUILD/php-pecl-runkit-0.9/runkit/runkit.c:83:2: 
warning: (near initialization for 'runkit_functions[2]') [enabled by default]
/home/fedora/hubbitus/rpmbuild/BUILD/php-pecl-runkit-0.9/runkit/runkit.c:83:2: 
warning: excess elements in scalar initializer [enabled by default]
/home/fedora/hubbitus/rpmbuild/BUILD/php-pecl-runkit-0.9/runkit/runkit.c:83:2: 
warning: (near initialization for 'runkit_functions[2]') [enabled by default]
/home/fedora/hubbitus/rpmbuild/BUILD/php-pecl-runkit-0.9/runkit/runkit.c:83:122: 
warning: excess elements in scalar initializer [enabled by default]
/home/fedora/hubbitus/rpmbuild/BUILD/php-pecl-runkit-0.9/runkit/runkit.c:83:122: 
warning: (near initialization for 'runkit_functions[2]') [enabled by default]
/home/fedora/hubbitus/rpmbuild/BUILD/php-pecl-runkit-0.9/runkit/runkit.c:83:122: 
warning: excess elements in scalar initializer [enabled by default]
/home/fedora/hubbitus/rpmbuild/BUILD/php-pecl-runkit-0.9/runkit/runkit.c:83:122: 
warning: (near initialization for 'runkit_functions[2]') [enabled by default]
/home/fedora/hubbitus/rpmbuild/BUILD/php-pecl-runkit-0.9/runkit/runkit.c:86:2: 
warning: braces around scalar initializer [enabled by default]
/home/fedora/hubbitus/rpmbuild/BUILD/php-pecl-runkit-0.9/runkit/runkit.c:86:2: 
warning: (near initialization for 'runkit_functions[3]') [enabled by default]
/home/fedora/hubbitus/rpmbuild/BUILD/php-pecl-runkit-0.9/runkit/runkit.c:86:2: 
warning: initialization makes integer from pointer without a cast [enabled by 
default]
/home/fedora/hubbitus/rpmbuild/BUILD/php-pecl-runkit-0.9/runkit/runkit.c:86:2: 
warning: (near initialization for 'runkit_functions[3]') [enabled by default]
/home/fedora/hubbitus/rpmbuild/BUILD/php-pecl-runkit-0.9/runkit/runkit.c:86:2: 
error: initializer element is not computable at load time
/home/fedora/hubbitus/rpmbuild/BUILD/php-pecl-runkit-0.9/runkit/runkit.c:86:2: 
error: (near initialization for 'runkit_functions[3]')
/home/fedora/hubbitus/rpmbuild/BUILD/php-pecl-runkit-0.9/runkit/runkit.c:86:2: 
warning: excess elements in scalar initializer [enabled by default]
/home/fedora/hubbitus/rpmbuild/BUILD/php-pecl-runkit-0.9/runkit/runkit.c:86:2: 
warning: (near initialization for 'runkit_functions[3]') [enabled by default]
/home/fedora/hubbitus/rpmbuild/BUILD/php-pecl-runkit-0.9/runkit/runkit.c:86:2: 
warning: excess elements in scalar initializer [enabled by default]
/home/fedora/hubbitus/rpmbuild/BUILD/php-pecl-runkit-0.9/runkit/runkit.c:86:2: 
warning: (near initialization for 'runkit_functions[3]') [enabled by default]
/home/fedora/hubbitus/rpmbuild/BUILD/php-pecl-runkit-0.9/runkit/runkit.c:86:112: 
warning: excess elements in scalar initializer [enabled by default]
/home/fedora/hubbitus/rpmbuild/BUILD/php-pecl-runkit-0.9/runkit/runkit.c:86:112: 
warning: (near initialization for 'runkit_functions[3]') [enabled by default]
/home/fedora/hubbitus/rpmbuild/BUILD/php-pecl-runkit-0.9/runkit/runkit.c:86:112: 
warning: excess elements in scalar initializer [enabled by default]
/home/fedora/hubbitus/rpmbuild/BUILD/php-pecl-runkit-0.9/runkit/runkit.c:86:112: 
warning: (near initialization for 'runkit_functions[3]') [enabled by default]
/home/fedora/hubbitus/rpmbuild/BUILD/php-pecl-runkit-0.9/runkit/runkit.c:90:2: 
warning: braces around scalar initializer [enabled by default]
/home/fedora/hubbitus/rpmbuild/BUILD/php-pecl-runkit-0.9/runkit/runkit.c:90:2: 
warning: (near initialization for 'runkit_functions[4]') [enabled by default]
/home/fedora/hubbitus/rpmbuild/BUILD/php-pecl-runkit-0.9/runkit/runkit.c:90:2: 
warning: initialization makes integer from pointer without a cast [enabled by 
default]
/home/fedora/hubbitus/rpmbuild/BUILD/php-pecl-runkit-0.9/runkit/runkit.c:90:2: 
warning: (near initialization for 'runkit_functions[4]') [enabled by default]
/home/fedora/hubbitus/rpmbuild/BUILD/php-pecl-runkit-0.9/runkit/runkit.c:90:2: 
error: initializer element is not computable at load time
/home/fedora/hubbitus/rpmbuild/BUILD/php-pecl-runkit-0.9/runkit/runkit.c:90:2: 
error: (near initialization for 'runkit_functions[4]')
/home/fedora/hubbitus/rpmbuild/BUILD/php-pecl-runkit-0.9/runkit/runkit.c:90:2: 
warning: excess elements in scalar initializer [enabled by default]
/home/fedora/hubbitus/rpmbuild/BUILD/php-pecl-runkit-0.9/runkit/runkit.c:90:2: 
warning: (near initialization for 'runkit_functions[4]') [enabled by default]
/home/fedora/hubbitus/rpmbuild/BUILD/php-pecl-runkit-0.9/runkit/runkit.c:90:2: 
warning: excess elements in scalar initializer [enabled by default]
/home/fedora/hubbitus/rpmbuild/BUILD/php-pecl-runkit-0.9/runkit/runkit.c:90:2: 
warning: (near initialization for 'runkit_functions[4]') [enabled by default]
/home/fedora/hubbitus/rpmbuild/BUILD/php-pecl-runkit-0.9/runkit/runkit.c:90:120: 
warning: excess elements in scalar initializer [enabled by default]
/home/fedora/hubbitus/rpmbuild/BUILD/php-pecl-runkit-0.9/runkit/runkit.c:90:120: 
warning: (near initialization for 'runkit_functions[4]') [enabled by default]
/home/fedora/hubbitus/rpmbuild/BUILD/php-pecl-runkit-0.9/runkit/runkit.c:90:120: 
warning: excess elements in scalar initializer [enabled by default]
/home/fedora/hubbitus/rpmbuild/BUILD/php-pecl-runkit-0.9/runkit/runkit.c:90:120: 
warning: (near initialization for 'runkit_functions[4]') [enabled by default]
/home/fedora/hubbitus/rpmbuild/BUILD/php-pecl-runkit-0.9/runkit/runkit.c:91:2: 
warning: braces around scalar initializer [enabled by default]
/home/fedora/hubbitus/rpmbuild/BUILD/php-pecl-runkit-0.9/runkit/runkit.c:91:2: 
warning: (near initialization for 'runkit_functions[5]') [enabled by default]
/home/fedora/hubbitus/rpmbuild/BUILD/php-pecl-runkit-0.9/runkit/runkit.c:91:2: 
warning: initialization makes integer from pointer without a cast [enabled by 
default]
/home/fedora/hubbitus/rpmbuild/BUILD/php-pecl-runkit-0.9/runkit/runkit.c:91:2: 
warning: (near initialization for 'runkit_functions[5]') [enabled by default]
/home/fedora/hubbitus/rpmbuild/BUILD/php-pecl-runkit-0.9/runkit/runkit.c:91:2: 
error: initializer element is not computable at load time
/home/fedora/hubbitus/rpmbuild/BUILD/php-pecl-runkit-0.9/runkit/runkit.c:91:2: 
error: (near initialization for 'runkit_functions[5]')
/home/fedora/hubbitus/rpmbuild/BUILD/php-pecl-runkit-0.9/runkit/runkit.c:91:2: 
warning: excess elements in scalar initializer [enabled by default]
/home/fedora/hubbitus/rpmbuild/BUILD/php-pecl-runkit-0.9/runkit/runkit.c:91:2: 
warning: (near initialization for 'runkit_functions[5]') [enabled by default]
/home/fedora/hubbitus/rpmbuild/BUILD/php-pecl-runkit-0.9/runkit/runkit.c:91:2: 
warning: excess elements in scalar initializer [enabled by default]
/home/fedora/hubbitus/rpmbuild/BUILD/php-pecl-runkit-0.9/runkit/runkit.c:91:2: 
warning: (near initialization for 'runkit_functions[5]') [enabled by default]
/home/fedora/hubbitus/rpmbuild/BUILD/php-pecl-runkit-0.9/runkit/runkit.c:91:110: 
warning: excess elements in scalar initializer [enabled by default]
/home/fedora/hubbitus/rpmbuild/BUILD/php-pecl-runkit-0.9/runkit/runkit.c:91:110: 
warning: (near initialization for 'runkit_functions[5]') [enabled by default]
/home/fedora/hubbitus/rpmbuild/BUILD/php-pecl-runkit-0.9/runkit/runkit.c:91:110: 
warning: excess elements in scalar initializer [enabled by default]
/home/fedora/hubbitus/rpmbuild/BUILD/php-pecl-runkit-0.9/runkit/runkit.c:91:110: 
warning: (near initialization for 'runkit_functions[5]') [enabled by default]
/home/fedora/hubbitus/rpmbuild/BUILD/php-pecl-runkit-0.9/runkit/runkit.c:92:2: 
warning: braces around scalar initializer [enabled by default]
/home/fedora/hubbitus/rpmbuild/BUILD/php-pecl-runkit-0.9/runkit/runkit.c:92:2: 
warning: (near initialization for 'runkit_functions[6]') [enabled by default]
/home/fedora/hubbitus/rpmbuild/BUILD/php-pecl-runkit-0.9/runkit/runkit.c:92:2: 
warning: initialization makes integer from pointer without a cast [enabled by 
default]
/home/fedora/hubbitus/rpmbuild/BUILD/php-pecl-runkit-0.9/runkit/runkit.c:92:2: 
warning: (near initialization for 'runkit_functions[6]') [enabled by default]
/home/fedora/hubbitus/rpmbuild/BUILD/php-pecl-runkit-0.9/runkit/runkit.c:92:2: 
error: initializer element is not computable at load time
/home/fedora/hubbitus/rpmbuild/BUILD/php-pecl-runkit-0.9/runkit/runkit.c:92:2: 
error: (near initialization for 'runkit_functions[6]')
/home/fedora/hubbitus/rpmbuild/BUILD/php-pecl-runkit-0.9/runkit/runkit.c:92:2: 
warning: excess elements in scalar initializer [enabled by default]
/home/fedora/hubbitus/rpmbuild/BUILD/php-pecl-runkit-0.9/runkit/runkit.c:92:2: 
warning: (near initialization for 'runkit_functions[6]') [enabled by default]
/home/fedora/hubbitus/rpmbuild/BUILD/php-pecl-runkit-0.9/runkit/runkit.c:92:2: 
warning: excess elements in scalar initializer [enabled by default]
/home/fedora/hubbitus/rpmbuild/BUILD/php-pecl-runkit-0.9/runkit/runkit.c:92:2: 
warning: (near initialization for 'runkit_functions[6]') [enabled by default]
/home/fedora/hubbitus/rpmbuild/BUILD/php-pecl-runkit-0.9/runkit/runkit.c:92:100: 
warning: excess elements in scalar initializer [enabled by default]
/home/fedora/hubbitus/rpmbuild/BUILD/php-pecl-runkit-0.9/runkit/runkit.c:92:100: 
warning: (near initialization for 'runkit_functions[6]') [enabled by default]
/home/fedora/hubbitus/rpmbuild/BUILD/php-pecl-runkit-0.9/runkit/runkit.c:92:100: 
warning: excess elements in scalar initializer [enabled by default]
/home/fedora/hubbitus/rpmbuild/BUILD/php-pecl-runkit-0.9/runkit/runkit.c:92:100: 
warning: (near initialization for 'runkit_functions[6]') [enabled by default]
/home/fedora/hubbitus/rpmbuild/BUILD/php-pecl-runkit-0.9/runkit/runkit.c:94:2: 
warning: braces around scalar initializer [enabled by default]
/home/fedora/hubbitus/rpmbuild/BUILD/php-pecl-runkit-0.9/runkit/runkit.c:94:2: 
warning: (near initialization for 'runkit_functions[7]') [enabled by default]
/home/fedora/hubbitus/rpmbuild/BUILD/php-pecl-runkit-0.9/runkit/runkit.c:94:2: 
warning: initialization makes integer from pointer without a cast [enabled by 
default]
/home/fedora/hubbitus/rpmbuild/BUILD/php-pecl-runkit-0.9/runkit/runkit.c:94:2: 
warning: (near initialization for 'runkit_functions[7]') [enabled by default]
/home/fedora/hubbitus/rpmbuild/BUILD/php-pecl-runkit-0.9/runkit/runkit.c:94:2: 
error: initializer element is not computable at load time
/home/fedora/hubbitus/rpmbuild/BUILD/php-pecl-runkit-0.9/runkit/runkit.c:94:2: 
error: (near initialization for 'runkit_functions[7]')
/home/fedora/hubbitus/rpmbuild/BUILD/php-pecl-runkit-0.9/runkit/runkit.c:94:2: 
warning: excess elements in scalar initializer [enabled by default]
/home/fedora/hubbitus/rpmbuild/BUILD/php-pecl-runkit-0.9/runkit/runkit.c:94:2: 
warning: (near initialization for 'runkit_functions[7]') [enabled by default]
/home/fedora/hubbitus/rpmbuild/BUILD/php-pecl-runkit-0.9/runkit/runkit.c:94:2: 
warning: excess elements in scalar initializer [enabled by default]
/home/fedora/hubbitus/rpmbuild/BUILD/php-pecl-runkit-0.9/runkit/runkit.c:94:2: 
warning: (near initialization for 'runkit_functions[7]') [enabled by default]
/home/fedora/hubbitus/rpmbuild/BUILD/php-pecl-runkit-0.9/runkit/runkit.c:94:112: 
warning: excess elements in scalar initializer [enabled by default]
/home/fedora/hubbitus/rpmbuild/BUILD/php-pecl-runkit-0.9/runkit/runkit.c:94:112: 
warning: (near initialization for 'runkit_functions[7]') [enabled by default]
/home/fedora/hubbitus/rpmbuild/BUILD/php-pecl-runkit-0.9/runkit/runkit.c:94:112: 
warning: excess elements in scalar initializer [enabled by default]
/home/fedora/hubbitus/rpmbuild/BUILD/php-pecl-runkit-0.9/runkit/runkit.c:94:112: 
warning: (near initialization for 'runkit_functions[7]') [enabled by default]
/home/fedora/hubbitus/rpmbuild/BUILD/php-pecl-runkit-0.9/runkit/runkit.c:95:2: 
warning: braces around scalar initializer [enabled by default]
/home/fedora/hubbitus/rpmbuild/BUILD/php-pecl-runkit-0.9/runkit/runkit.c:95:2: 
warning: (near initialization for 'runkit_functions[8]') [enabled by default]
/home/fedora/hubbitus/rpmbuild/BUILD/php-pecl-runkit-0.9/runkit/runkit.c:95:2: 
warning: initialization makes integer from pointer without a cast [enabled by 
default]
/home/fedora/hubbitus/rpmbuild/BUILD/php-pecl-runkit-0.9/runkit/runkit.c:95:2: 
warning: (near initialization for 'runkit_functions[8]') [enabled by default]
/home/fedora/hubbitus/rpmbuild/BUILD/php-pecl-runkit-0.9/runkit/runkit.c:95:2: 
error: initializer element is not computable at load time
/home/fedora/hubbitus/rpmbuild/BUILD/php-pecl-runkit-0.9/runkit/runkit.c:95:2: 
error: (near initialization for 'runkit_functions[8]')
/home/fedora/hubbitus/rpmbuild/BUILD/php-pecl-runkit-0.9/runkit/runkit.c:95:2: 
warning: excess elements in scalar initializer [enabled by default]
/home/fedora/hubbitus/rpmbuild/BUILD/php-pecl-runkit-0.9/runkit/runkit.c:95:2: 
warning: (near initialization for 'runkit_functions[8]') [enabled by default]
/home/fedora/hubbitus/rpmbuild/BUILD/php-pecl-runkit-0.9/runkit/runkit.c:95:2: 
warning: excess elements in scalar initializer [enabled by default]
/home/fedora/hubbitus/rpmbuild/BUILD/php-pecl-runkit-0.9/runkit/runkit.c:95:2: 
warning: (near initialization for 'runkit_functions[8]') [enabled by default]
/home/fedora/hubbitus/rpmbuild/BUILD/php-pecl-runkit-0.9/runkit/runkit.c:95:118: 
warning: excess elements in scalar initializer [enabled by default]
/home/fedora/hubbitus/rpmbuild/BUILD/php-pecl-runkit-0.9/runkit/runkit.c:95:118: 
warning: (near initialization for 'runkit_functions[8]') [enabled by default]
/home/fedora/hubbitus/rpmbuild/BUILD/php-pecl-runkit-0.9/runkit/runkit.c:95:118: 
warning: excess elements in scalar initializer [enabled by default]
/home/fedora/hubbitus/rpmbuild/BUILD/php-pecl-runkit-0.9/runkit/runkit.c:95:118: 
warning: (near initialization for 'runkit_functions[8]') [enabled by default]
/home/fedora/hubbitus/rpmbuild/BUILD/php-pecl-runkit-0.9/runkit/runkit.c:96:2: 
warning: braces around scalar initializer [enabled by default]
/home/fedora/hubbitus/rpmbuild/BUILD/php-pecl-runkit-0.9/runkit/runkit.c:96:2: 
warning: (near initialization for 'runkit_functions[9]') [enabled by default]
/home/fedora/hubbitus/rpmbuild/BUILD/php-pecl-runkit-0.9/runkit/runkit.c:96:2: 
warning: initialization makes integer from pointer without a cast [enabled by 
default]
/home/fedora/hubbitus/rpmbuild/BUILD/php-pecl-runkit-0.9/runkit/runkit.c:96:2: 
warning: (near initialization for 'runkit_functions[9]') [enabled by default]
/home/fedora/hubbitus/rpmbuild/BUILD/php-pecl-runkit-0.9/runkit/runkit.c:96:2: 
error: initializer element is not computable at load time
/home/fedora/hubbitus/rpmbuild/BUILD/php-pecl-runkit-0.9/runkit/runkit.c:96:2: 
error: (near initialization for 'runkit_functions[9]')
/home/fedora/hubbitus/rpmbuild/BUILD/php-pecl-runkit-0.9/runkit/runkit.c:96:2: 
warning: excess elements in scalar initializer [enabled by default]
/home/fedora/hubbitus/rpmbuild/BUILD/php-pecl-runkit-0.9/runkit/runkit.c:96:2: 
warning: (near initialization for 'runkit_functions[9]') [enabled by default]
/home/fedora/hubbitus/rpmbuild/BUILD/php-pecl-runkit-0.9/runkit/runkit.c:96:2: 
warning: excess elements in scalar initializer [enabled by default]
/home/fedora/hubbitus/rpmbuild/BUILD/php-pecl-runkit-0.9/runkit/runkit.c:96:2: 
warning: (near initialization for 'runkit_functions[9]') [enabled by default]
/home/fedora/hubbitus/rpmbuild/BUILD/php-pecl-runkit-0.9/runkit/runkit.c:96:118: 
warning: excess elements in scalar initializer [enabled by default]
/home/fedora/hubbitus/rpmbuild/BUILD/php-pecl-runkit-0.9/runkit/runkit.c:96:118: 
warning: (near initialization for 'runkit_functions[9]') [enabled by default]
/home/fedora/hubbitus/rpmbuild/BUILD/php-pecl-runkit-0.9/runkit/runkit.c:96:118: 
warning: excess elements in scalar initializer [enabled by default]
/home/fedora/hubbitus/rpmbuild/BUILD/php-pecl-runkit-0.9/runkit/runkit.c:96:118: 
warning: (near initialization for 'runkit_functions[9]') [enabled by default]
/home/fedora/hubbitus/rpmbuild/BUILD/php-pecl-runkit-0.9/runkit/runkit.c:97:2: 
warning: braces around scalar initializer [enabled by default]
/home/fedora/hubbitus/rpmbuild/BUILD/php-pecl-runkit-0.9/runkit/runkit.c:97:2: 
warning: (near initialization for 'runkit_functions[10]') [enabled by default]
/home/fedora/hubbitus/rpmbuild/BUILD/php-pecl-runkit-0.9/runkit/runkit.c:97:2: 
warning: initialization makes integer from pointer without a cast [enabled by 
default]
/home/fedora/hubbitus/rpmbuild/BUILD/php-pecl-runkit-0.9/runkit/runkit.c:97:2: 
warning: (near initialization for 'runkit_functions[10]') [enabled by default]
/home/fedora/hubbitus/rpmbuild/BUILD/php-pecl-runkit-0.9/runkit/runkit.c:97:2: 
error: initializer element is not computable at load time
/home/fedora/hubbitus/rpmbuild/BUILD/php-pecl-runkit-0.9/runkit/runkit.c:97:2: 
error: (near initialization for 'runkit_functions[10]')
/home/fedora/hubbitus/rpmbuild/BUILD/php-pecl-runkit-0.9/runkit/runkit.c:97:2: 
warning: excess elements in scalar initializer [enabled by default]
/home/fedora/hubbitus/rpmbuild/BUILD/php-pecl-runkit-0.9/runkit/runkit.c:97:2: 
warning: (near initialization for 'runkit_functions[10]') [enabled by default]
/home/fedora/hubbitus/rpmbuild/BUILD/php-pecl-runkit-0.9/runkit/runkit.c:97:2: 
warning: excess elements in scalar initializer [enabled by default]
/home/fedora/hubbitus/rpmbuild/BUILD/php-pecl-runkit-0.9/runkit/runkit.c:97:2: 
warning: (near initialization for 'runkit_functions[10]') [enabled by default]
/home/fedora/hubbitus/rpmbuild/BUILD/php-pecl-runkit-0.9/runkit/runkit.c:97:122: 
warning: excess elements in scalar initializer [enabled by default]
/home/fedora/hubbitus/rpmbuild/BUILD/php-pecl-runkit-0.9/runkit/runkit.c:97:122: 
warning: (near initialization for 'runkit_functions[10]') [enabled by default]
/home/fedora/hubbitus/rpmbuild/BUILD/php-pecl-runkit-0.9/runkit/runkit.c:97:122: 
warning: excess elements in scalar initializer [enabled by default]
/home/fedora/hubbitus/rpmbuild/BUILD/php-pecl-runkit-0.9/runkit/runkit.c:97:122: 
warning: (near initialization for 'runkit_functions[10]') [enabled by default]
/home/fedora/hubbitus/rpmbuild/BUILD/php-pecl-runkit-0.9/runkit/runkit.c:98:2: 
warning: braces around scalar initializer [enabled by default]
/home/fedora/hubbitus/rpmbuild/BUILD/php-pecl-runkit-0.9/runkit/runkit.c:98:2: 
warning: (near initialization for 'runkit_functions[11]') [enabled by default]
/home/fedora/hubbitus/rpmbuild/BUILD/php-pecl-runkit-0.9/runkit/runkit.c:98:2: 
warning: initialization makes integer from pointer without a cast [enabled by 
default]
/home/fedora/hubbitus/rpmbuild/BUILD/php-pecl-runkit-0.9/runkit/runkit.c:98:2: 
warning: (near initialization for 'runkit_functions[11]') [enabled by default]
/home/fedora/hubbitus/rpmbuild/BUILD/php-pecl-runkit-0.9/runkit/runkit.c:98:2: 
error: initializer element is not computable at load time
/home/fedora/hubbitus/rpmbuild/BUILD/php-pecl-runkit-0.9/runkit/runkit.c:98:2: 
error: (near initialization for 'runkit_functions[11]')
/home/fedora/hubbitus/rpmbuild/BUILD/php-pecl-runkit-0.9/runkit/runkit.c:98:2: 
warning: excess elements in scalar initializer [enabled by default]
/home/fedora/hubbitus/rpmbuild/BUILD/php-pecl-runkit-0.9/runkit/runkit.c:98:2: 
warning: (near initialization for 'runkit_functions[11]') [enabled by default]
/home/fedora/hubbitus/rpmbuild/BUILD/php-pecl-runkit-0.9/runkit/runkit.c:98:2: 
warning: excess elements in scalar initializer [enabled by default]
/home/fedora/hubbitus/rpmbuild/BUILD/php-pecl-runkit-0.9/runkit/runkit.c:98:2: 
warning: (near initialization for 'runkit_functions[11]') [enabled by default]
/home/fedora/hubbitus/rpmbuild/BUILD/php-pecl-runkit-0.9/runkit/runkit.c:98:114: 
warning: excess elements in scalar initializer [enabled by default]
/home/fedora/hubbitus/rpmbuild/BUILD/php-pecl-runkit-0.9/runkit/runkit.c:98:114: 
warning: (near initialization for 'runkit_functions[11]') [enabled by default]
/home/fedora/hubbitus/rpmbuild/BUILD/php-pecl-runkit-0.9/runkit/runkit.c:98:114: 
warning: excess elements in scalar initializer [enabled by default]
/home/fedora/hubbitus/rpmbuild/BUILD/php-pecl-runkit-0.9/runkit/runkit.c:98:114: 
warning: (near initialization for 'runkit_functions[11]') [enabled by default]
/home/fedora/hubbitus/rpmbuild/BUILD/php-pecl-runkit-0.9/runkit/runkit.c:100:2: 
warning: braces around scalar initializer [enabled by default]
/home/fedora/hubbitus/rpmbuild/BUILD/php-pecl-runkit-0.9/runkit/runkit.c:100:2: 
warning: (near initialization for 'runkit_functions[12]') [enabled by default]
/home/fedora/hubbitus/rpmbuild/BUILD/php-pecl-runkit-0.9/runkit/runkit.c:100:2: 
warning: initialization makes integer from pointer without a cast [enabled by 
default]
/home/fedora/hubbitus/rpmbuild/BUILD/php-pecl-runkit-0.9/runkit/runkit.c:100:2: 
warning: (near initialization for 'runkit_functions[12]') [enabled by default]
/home/fedora/hubbitus/rpmbuild/BUILD/php-pecl-runkit-0.9/runkit/runkit.c:100:2: 
error: initializer element is not computable at load time
/home/fedora/hubbitus/rpmbuild/BUILD/php-pecl-runkit-0.9/runkit/runkit.c:100:2: 
error: (near initialization for 'runkit_functions[12]')
/home/fedora/hubbitus/rpmbuild/BUILD/php-pecl-runkit-0.9/runkit/runkit.c:100:2: 
warning: excess elements in scalar initializer [enabled by default]
/home/fedora/hubbitus/rpmbuild/BUILD/php-pecl-runkit-0.9/runkit/runkit.c:100:2: 
warning: (near initialization for 'runkit_functions[12]') [enabled by default]
/home/fedora/hubbitus/rpmbuild/BUILD/php-pecl-runkit-0.9/runkit/runkit.c:100:2: 
warning: excess elements in scalar initializer [enabled by default]
/home/fedora/hubbitus/rpmbuild/BUILD/php-pecl-runkit-0.9/runkit/runkit.c:100:2: 
warning: (near initialization for 'runkit_functions[12]') [enabled by default]
/home/fedora/hubbitus/rpmbuild/BUILD/php-pecl-runkit-
0.9/runkit/runkit.c:100:108: warning: excess elements in scalar initializer 
[enabled by default]
/home/fedora/hubbitus/rpmbuild/BUILD/php-pecl-runkit-
0.9/runkit/runkit.c:100:108: warning: (near initialization for 
'runkit_functions[12]') [enabled by default]
/home/fedora/hubbitus/rpmbuild/BUILD/php-pecl-runkit-
0.9/runkit/runkit.c:100:108: warning: excess elements in scalar initializer 
[enabled by default]
/home/fedora/hubbitus/rpmbuild/BUILD/php-pecl-runkit-
0.9/runkit/runkit.c:100:108: warning: (near initialization for 
'runkit_functions[12]') [enabled by default]
/home/fedora/hubbitus/rpmbuild/BUILD/php-pecl-runkit-0.9/runkit/runkit.c:101:2: 
warning: braces around scalar initializer [enabled by default]
/home/fedora/hubbitus/rpmbuild/BUILD/php-pecl-runkit-0.9/runkit/runkit.c:101:2: 
warning: (near initialization for 'runkit_functions[13]') [enabled by default]
/home/fedora/hubbitus/rpmbuild/BUILD/php-pecl-runkit-0.9/runkit/runkit.c:101:2: 
warning: initialization makes integer from pointer without a cast [enabled by 
default]
/home/fedora/hubbitus/rpmbuild/BUILD/php-pecl-runkit-0.9/runkit/runkit.c:101:2: 
warning: (near initialization for 'runkit_functions[13]') [enabled by default]
/home/fedora/hubbitus/rpmbuild/BUILD/php-pecl-runkit-0.9/runkit/runkit.c:101:2: 
error: initializer element is not computable at load time
/home/fedora/hubbitus/rpmbuild/BUILD/php-pecl-runkit-0.9/runkit/runkit.c:101:2: 
error: (near initialization for 'runkit_functions[13]')
/home/fedora/hubbitus/rpmbuild/BUILD/php-pecl-runkit-0.9/runkit/runkit.c:101:2: 
warning: excess elements in scalar initializer [enabled by default]
/home/fedora/hubbitus/rpmbuild/BUILD/php-pecl-runkit-0.9/runkit/runkit.c:101:2: 
warning: (near initialization for 'runkit_functions[13]') [enabled by default]
/home/fedora/hubbitus/rpmbuild/BUILD/php-pecl-runkit-0.9/runkit/runkit.c:101:2: 
warning: excess elements in scalar initializer [enabled by default]
/home/fedora/hubbitus/rpmbuild/BUILD/php-pecl-runkit-0.9/runkit/runkit.c:101:2: 
warning: (near initialization for 'runkit_functions[13]') [enabled by default]
/home/fedora/hubbitus/rpmbuild/BUILD/php-pecl-runkit-
0.9/runkit/runkit.c:101:118: warning: excess elements in scalar initializer 
[enabled by default]
/home/fedora/hubbitus/rpmbuild/BUILD/php-pecl-runkit-
0.9/runkit/runkit.c:101:118: warning: (near initialization for 
'runkit_functions[13]') [enabled by default]
/home/fedora/hubbitus/rpmbuild/BUILD/php-pecl-runkit-
0.9/runkit/runkit.c:101:118: warning: excess elements in scalar initializer 
[enabled by default]
/home/fedora/hubbitus/rpmbuild/BUILD/php-pecl-runkit-
0.9/runkit/runkit.c:101:118: warning: (near initialization for 
'runkit_functions[13]') [enabled by default]
/home/fedora/hubbitus/rpmbuild/BUILD/php-pecl-runkit-0.9/runkit/runkit.c:102:2: 
warning: braces around scalar initializer [enabled by default]
/home/fedora/hubbitus/rpmbuild/BUILD/php-pecl-runkit-0.9/runkit/runkit.c:102:2: 
warning: (near initialization for 'runkit_functions[14]') [enabled by default]
/home/fedora/hubbitus/rpmbuild/BUILD/php-pecl-runkit-0.9/runkit/runkit.c:102:2: 
warning: initialization makes integer from pointer without a cast [enabled by 
default]
/home/fedora/hubbitus/rpmbuild/BUILD/php-pecl-runkit-0.9/runkit/runkit.c:102:2: 
warning: (near initialization for 'runkit_functions[14]') [enabled by default]
/home/fedora/hubbitus/rpmbuild/BUILD/php-pecl-runkit-0.9/runkit/runkit.c:102:2: 
error: initializer element is not computable at load time
/home/fedora/hubbitus/rpmbuild/BUILD/php-pecl-runkit-0.9/runkit/runkit.c:102:2: 
error: (near initialization for 'runkit_functions[14]')
/home/fedora/hubbitus/rpmbuild/BUILD/php-pecl-runkit-0.9/runkit/runkit.c:102:2: 
warning: excess elements in scalar initializer [enabled by default]
/home/fedora/hubbitus/rpmbuild/BUILD/php-pecl-runkit-0.9/runkit/runkit.c:102:2: 
warning: (near initialization for 'runkit_functions[14]') [enabled by default]
/home/fedora/hubbitus/rpmbuild/BUILD/php-pecl-runkit-0.9/runkit/runkit.c:102:2: 
warning: excess elements in scalar initializer [enabled by default]
/home/fedora/hubbitus/rpmbuild/BUILD/php-pecl-runkit-0.9/runkit/runkit.c:102:2: 
warning: (near initialization for 'runkit_functions[14]') [enabled by default]
/home/fedora/hubbitus/rpmbuild/BUILD/php-pecl-runkit-
0.9/runkit/runkit.c:102:114: warning: excess elements in scalar initializer 
[enabled by default]
/home/fedora/hubbitus/rpmbuild/BUILD/php-pecl-runkit-
0.9/runkit/runkit.c:102:114: warning: (near initialization for 
'runkit_functions[14]') [enabled by default]
/home/fedora/hubbitus/rpmbuild/BUILD/php-pecl-runkit-
0.9/runkit/runkit.c:102:114: warning: excess elements in scalar initializer 
[enabled by default]
/home/fedora/hubbitus/rpmbuild/BUILD/php-pecl-runkit-
0.9/runkit/runkit.c:102:114: warning: (near initialization for 
'runkit_functions[14]') [enabled by default]
/home/fedora/hubbitus/rpmbuild/BUILD/php-pecl-runkit-0.9/runkit/runkit.c:103:2: 
warning: braces around scalar initializer [enabled by default]
/home/fedora/hubbitus/rpmbuild/BUILD/php-pecl-runkit-0.9/runkit/runkit.c:103:2: 
warning: (near initialization for 'runkit_functions[15]') [enabled by default]
/home/fedora/hubbitus/rpmbuild/BUILD/php-pecl-runkit-0.9/runkit/runkit.c:103:2: 
warning: initialization makes integer from pointer without a cast [enabled by 
default]
/home/fedora/hubbitus/rpmbuild/BUILD/php-pecl-runkit-0.9/runkit/runkit.c:103:2: 
warning: (near initialization for 'runkit_functions[15]') [enabled by default]
/home/fedora/hubbitus/rpmbuild/BUILD/php-pecl-runkit-0.9/runkit/runkit.c:103:2: 
error: initializer element is not computable at load time
/home/fedora/hubbitus/rpmbuild/BUILD/php-pecl-runkit-0.9/runkit/runkit.c:103:2: 
error: (near initialization for 'runkit_functions[15]')
/home/fedora/hubbitus/rpmbuild/BUILD/php-pecl-runkit-0.9/runkit/runkit.c:103:2: 
warning: excess elements in scalar initializer [enabled by default]
/home/fedora/hubbitus/rpmbuild/BUILD/php-pecl-runkit-0.9/runkit/runkit.c:103:2: 
warning: (near initialization for 'runkit_functions[15]') [enabled by default]
/home/fedora/hubbitus/rpmbuild/BUILD/php-pecl-runkit-0.9/runkit/runkit.c:103:2: 
warning: excess elements in scalar initializer [enabled by default]
/home/fedora/hubbitus/rpmbuild/BUILD/php-pecl-runkit-0.9/runkit/runkit.c:103:2: 
warning: (near initialization for 'runkit_functions[15]') [enabled by default]
/home/fedora/hubbitus/rpmbuild/BUILD/php-pecl-runkit-
0.9/runkit/runkit.c:103:114: warning: excess elements in scalar initializer 
[enabled by default]
/home/fedora/hubbitus/rpmbuild/BUILD/php-pecl-runkit-
0.9/runkit/runkit.c:103:114: warning: (near initialization for 
'runkit_functions[15]') [enabled by default]
/home/fedora/hubbitus/rpmbuild/BUILD/php-pecl-runkit-
0.9/runkit/runkit.c:103:114: warning: excess elements in scalar initializer 
[enabled by default]
/home/fedora/hubbitus/rpmbuild/BUILD/php-pecl-runkit-
0.9/runkit/runkit.c:103:114: warning: (near initialization for 
'runkit_functions[15]') [enabled by default]
/home/fedora/hubbitus/rpmbuild/BUILD/php-pecl-runkit-0.9/runkit/runkit.c:104:2: 
warning: braces around scalar initializer [enabled by default]
/home/fedora/hubbitus/rpmbuild/BUILD/php-pecl-runkit-0.9/runkit/runkit.c:104:2: 
warning: (near initialization for 'runkit_functions[16]') [enabled by default]
/home/fedora/hubbitus/rpmbuild/BUILD/php-pecl-runkit-0.9/runkit/runkit.c:104:2: 
warning: initialization makes integer from pointer without a cast [enabled by 
default]
/home/fedora/hubbitus/rpmbuild/BUILD/php-pecl-runkit-0.9/runkit/runkit.c:104:2: 
warning: (near initialization for 'runkit_functions[16]') [enabled by default]
/home/fedora/hubbitus/rpmbuild/BUILD/php-pecl-runkit-0.9/runkit/runkit.c:104:2: 
error: initializer element is not computable at load time
/home/fedora/hubbitus/rpmbuild/BUILD/php-pecl-runkit-0.9/runkit/runkit.c:104:2: 
error: (near initialization for 'runkit_functions[16]')
/home/fedora/hubbitus/rpmbuild/BUILD/php-pecl-runkit-0.9/runkit/runkit.c:104:2: 
warning: excess elements in scalar initializer [enabled by default]
/home/fedora/hubbitus/rpmbuild/BUILD/php-pecl-runkit-0.9/runkit/runkit.c:104:2: 
warning: (near initialization for 'runkit_functions[16]') [enabled by default]
/home/fedora/hubbitus/rpmbuild/BUILD/php-pecl-runkit-0.9/runkit/runkit.c:104:2: 
warning: excess elements in scalar initializer [enabled by default]
/home/fedora/hubbitus/rpmbuild/BUILD/php-pecl-runkit-0.9/runkit/runkit.c:104:2: 
warning: (near initialization for 'runkit_functions[16]') [enabled by default]
/home/fedora/hubbitus/rpmbuild/BUILD/php-pecl-runkit-
0.9/runkit/runkit.c:104:110: warning: excess elements in scalar initializer 
[enabled by default]
/home/fedora/hubbitus/rpmbuild/BUILD/php-pecl-runkit-
0.9/runkit/runkit.c:104:110: warning: (near initialization for 
'runkit_functions[16]') [enabled by default]
/home/fedora/hubbitus/rpmbuild/BUILD/php-pecl-runkit-
0.9/runkit/runkit.c:104:110: warning: excess elements in scalar initializer 
[enabled by default]
/home/fedora/hubbitus/rpmbuild/BUILD/php-pecl-runkit-
0.9/runkit/runkit.c:104:110: warning: (near initialization for 
'runkit_functions[16]') [enabled by default]
/home/fedora/hubbitus/rpmbuild/BUILD/php-pecl-runkit-0.9/runkit/runkit.c:115:2: 
warning: braces around scalar initializer [enabled by default]
/home/fedora/hubbitus/rpmbuild/BUILD/php-pecl-runkit-0.9/runkit/runkit.c:115:2: 
warning: (near initialization for 'runkit_functions[17]') [enabled by default]
/home/fedora/hubbitus/rpmbuild/BUILD/php-pecl-runkit-0.9/runkit/runkit.c:115:2: 
warning: initialization makes integer from pointer without a cast [enabled by 
default]
/home/fedora/hubbitus/rpmbuild/BUILD/php-pecl-runkit-0.9/runkit/runkit.c:115:2: 
warning: (near initialization for 'runkit_functions[17]') [enabled by default]
/home/fedora/hubbitus/rpmbuild/BUILD/php-pecl-runkit-0.9/runkit/runkit.c:115:2: 
error: initializer element is not computable at load time
/home/fedora/hubbitus/rpmbuild/BUILD/php-pecl-runkit-0.9/runkit/runkit.c:115:2: 
error: (near initialization for 'runkit_functions[17]')
/home/fedora/hubbitus/rpmbuild/BUILD/php-pecl-runkit-0.9/runkit/runkit.c:115:2: 
warning: excess elements in scalar initializer [enabled by default]
/home/fedora/hubbitus/rpmbuild/BUILD/php-pecl-runkit-0.9/runkit/runkit.c:115:2: 
warning: (near initialization for 'runkit_functions[17]') [enabled by default]
/home/fedora/hubbitus/rpmbuild/BUILD/php-pecl-runkit-0.9/runkit/runkit.c:115:2: 
warning: excess elements in scalar initializer [enabled by default]
/home/fedora/hubbitus/rpmbuild/BUILD/php-pecl-runkit-0.9/runkit/runkit.c:115:2: 
warning: (near initialization for 'runkit_functions[17]') [enabled by default]
/home/fedora/hubbitus/rpmbuild/BUILD/php-pecl-runkit-
0.9/runkit/runkit.c:115:122: warning: excess elements in scalar initializer 
[enabled by default]
/home/fedora/hubbitus/rpmbuild/BUILD/php-pecl-runkit-
0.9/runkit/runkit.c:115:122: warning: (near initialization for 
'runkit_functions[17]') [enabled by default]
/home/fedora/hubbitus/rpmbuild/BUILD/php-pecl-runkit-
0.9/runkit/runkit.c:115:122: warning: excess elements in scalar initializer 
[enabled by default]
/home/fedora/hubbitus/rpmbuild/BUILD/php-pecl-runkit-
0.9/runkit/runkit.c:115:122: warning: (near initialization for 
'runkit_functions[17]') [enabled by default]
/home/fedora/hubbitus/rpmbuild/BUILD/php-pecl-runkit-0.9/runkit/runkit.c:116:2: 
warning: braces around scalar initializer [enabled by default]
/home/fedora/hubbitus/rpmbuild/BUILD/php-pecl-runkit-0.9/runkit/runkit.c:116:2: 
warning: (near initialization for 'runkit_functions[18]') [enabled by default]
/home/fedora/hubbitus/rpmbuild/BUILD/php-pecl-runkit-0.9/runkit/runkit.c:116:2: 
warning: initialization makes integer from pointer without a cast [enabled by 
default]
/home/fedora/hubbitus/rpmbuild/BUILD/php-pecl-runkit-0.9/runkit/runkit.c:116:2: 
warning: (near initialization for 'runkit_functions[18]') [enabled by default]
/home/fedora/hubbitus/rpmbuild/BUILD/php-pecl-runkit-0.9/runkit/runkit.c:116:2: 
error: initializer element is not computable at load time
/home/fedora/hubbitus/rpmbuild/BUILD/php-pecl-runkit-0.9/runkit/runkit.c:116:2: 
error: (near initialization for 'runkit_functions[18]')
/home/fedora/hubbitus/rpmbuild/BUILD/php-pecl-runkit-0.9/runkit/runkit.c:116:2: 
warning: excess elements in scalar initializer [enabled by default]
/home/fedora/hubbitus/rpmbuild/BUILD/php-pecl-runkit-0.9/runkit/runkit.c:116:2: 
warning: (near initialization for 'runkit_functions[18]') [enabled by default]
/home/fedora/hubbitus/rpmbuild/BUILD/php-pecl-runkit-0.9/runkit/runkit.c:116:2: 
warning: excess elements in scalar initializer [enabled by default]
/home/fedora/hubbitus/rpmbuild/BUILD/php-pecl-runkit-0.9/runkit/runkit.c:116:2: 
warning: (near initialization for 'runkit_functions[18]') [enabled by default]
/home/fedora/hubbitus/rpmbuild/BUILD/php-pecl-runkit-
0.9/runkit/runkit.c:116:118: warning: excess elements in scalar initializer 
[enabled by default]
/home/fedora/hubbitus/rpmbuild/BUILD/php-pecl-runkit-
0.9/runkit/runkit.c:116:118: warning: (near initialization for 
'runkit_functions[18]') [enabled by default]
/home/fedora/hubbitus/rpmbuild/BUILD/php-pecl-runkit-
0.9/runkit/runkit.c:116:118: warning: excess elements in scalar initializer 
[enabled by default]
/home/fedora/hubbitus/rpmbuild/BUILD/php-pecl-runkit-
0.9/runkit/runkit.c:116:118: warning: (near initialization for 
'runkit_functions[18]') [enabled by default]
/home/fedora/hubbitus/rpmbuild/BUILD/php-pecl-runkit-0.9/runkit/runkit.c:117:2: 
warning: braces around scalar initializer [enabled by default]
/home/fedora/hubbitus/rpmbuild/BUILD/php-pecl-runkit-0.9/runkit/runkit.c:117:2: 
warning: (near initialization for 'runkit_functions[19]') [enabled by default]
/home/fedora/hubbitus/rpmbuild/BUILD/php-pecl-runkit-0.9/runkit/runkit.c:117:2: 
warning: initialization makes integer from pointer without a cast [enabled by 
default]
/home/fedora/hubbitus/rpmbuild/BUILD/php-pecl-runkit-0.9/runkit/runkit.c:117:2: 
warning: (near initialization for 'runkit_functions[19]') [enabled by default]
/home/fedora/hubbitus/rpmbuild/BUILD/php-pecl-runkit-0.9/runkit/runkit.c:117:2: 
error: initializer element is not computable at load time
/home/fedora/hubbitus/rpmbuild/BUILD/php-pecl-runkit-0.9/runkit/runkit.c:117:2: 
error: (near initialization for 'runkit_functions[19]')
/home/fedora/hubbitus/rpmbuild/BUILD/php-pecl-runkit-0.9/runkit/runkit.c:117:2: 
warning: excess elements in scalar initializer [enabled by default]
/home/fedora/hubbitus/rpmbuild/BUILD/php-pecl-runkit-0.9/runkit/runkit.c:117:2: 
warning: (near initialization for 'runkit_functions[19]') [enabled by default]
/home/fedora/hubbitus/rpmbuild/BUILD/php-pecl-runkit-0.9/runkit/runkit.c:117:2: 
warning: excess elements in scalar initializer [enabled by default]
/home/fedora/hubbitus/rpmbuild/BUILD/php-pecl-runkit-0.9/runkit/runkit.c:117:2: 
warning: (near initialization for 'runkit_functions[19]') [enabled by default]
/home/fedora/hubbitus/rpmbuild/BUILD/php-pecl-runkit-
0.9/runkit/runkit.c:117:112: warning: excess elements in scalar initializer 
[enabled by default]
/home/fedora/hubbitus/rpmbuild/BUILD/php-pecl-runkit-
0.9/runkit/runkit.c:117:112: warning: (near initialization for 
'runkit_functions[19]') [enabled by default]
/home/fedora/hubbitus/rpmbuild/BUILD/php-pecl-runkit-
0.9/runkit/runkit.c:117:112: warning: excess elements in scalar initializer 
[enabled by default]
/home/fedora/hubbitus/rpmbuild/BUILD/php-pecl-runkit-
0.9/runkit/runkit.c:117:112: warning: (near initialization for 
'runkit_functions[19]') [enabled by default]
/home/fedora/hubbitus/rpmbuild/BUILD/php-pecl-runkit-0.9/runkit/runkit.c:119:2: 
warning: braces around scalar initializer [enabled by default]
/home/fedora/hubbitus/rpmbuild/BUILD/php-pecl-runkit-0.9/runkit/runkit.c:119:2: 
warning: (near initialization for 'runkit_functions[20]') [enabled by default]
/home/fedora/hubbitus/rpmbuild/BUILD/php-pecl-runkit-0.9/runkit/runkit.c:119:2: 
warning: initialization makes integer from pointer without a cast [enabled by 
default]
/home/fedora/hubbitus/rpmbuild/BUILD/php-pecl-runkit-0.9/runkit/runkit.c:119:2: 
warning: (near initialization for 'runkit_functions[20]') [enabled by default]
/home/fedora/hubbitus/rpmbuild/BUILD/php-pecl-runkit-0.9/runkit/runkit.c:119:2: 
error: initializer element is not computable at load time
/home/fedora/hubbitus/rpmbuild/BUILD/php-pecl-runkit-0.9/runkit/runkit.c:119:2: 
error: (near initialization for 'runkit_functions[20]')
/home/fedora/hubbitus/rpmbuild/BUILD/php-pecl-runkit-0.9/runkit/runkit.c:119:2: 
warning: excess elements in scalar initializer [enabled by default]
/home/fedora/hubbitus/rpmbuild/BUILD/php-pecl-runkit-0.9/runkit/runkit.c:119:2: 
warning: (near initialization for 'runkit_functions[20]') [enabled by default]
/home/fedora/hubbitus/rpmbuild/BUILD/php-pecl-runkit-0.9/runkit/runkit.c:119:2: 
warning: excess elements in scalar initializer [enabled by default]
/home/fedora/hubbitus/rpmbuild/BUILD/php-pecl-runkit-0.9/runkit/runkit.c:119:2: 
warning: (near initialization for 'runkit_functions[20]') [enabled by default]
/home/fedora/hubbitus/rpmbuild/BUILD/php-pecl-runkit-
0.9/runkit/runkit.c:119:128: warning: excess elements in scalar initializer 
[enabled by default]
/home/fedora/hubbitus/rpmbuild/BUILD/php-pecl-runkit-
0.9/runkit/runkit.c:119:128: warning: (near initialization for 
'runkit_functions[20]') [enabled by default]
/home/fedora/hubbitus/rpmbuild/BUILD/php-pecl-runkit-
0.9/runkit/runkit.c:119:128: warning: excess elements in scalar initializer 
[enabled by default]
/home/fedora/hubbitus/rpmbuild/BUILD/php-pecl-runkit-
0.9/runkit/runkit.c:119:128: warning: (near initialization for 
'runkit_functions[20]') [enabled by default]
/home/fedora/hubbitus/rpmbuild/BUILD/php-pecl-runkit-0.9/runkit/runkit.c:128:2: 
warning: braces around scalar initializer [enabled by default]
/home/fedora/hubbitus/rpmbuild/BUILD/php-pecl-runkit-0.9/runkit/runkit.c:128:2: 
warning: (near initialization for 'runkit_functions[21]') [enabled by default]
/home/fedora/hubbitus/rpmbuild/BUILD/php-pecl-runkit-0.9/runkit/runkit.c:128:2: 
warning: initialization makes integer from pointer without a cast [enabled by 
default]
/home/fedora/hubbitus/rpmbuild/BUILD/php-pecl-runkit-0.9/runkit/runkit.c:128:2: 
warning: (near initialization for 'runkit_functions[21]') [enabled by default]
/home/fedora/hubbitus/rpmbuild/BUILD/php-pecl-runkit-0.9/runkit/runkit.c:128:2: 
warning: excess elements in scalar initializer [enabled by default]
/home/fedora/hubbitus/rpmbuild/BUILD/php-pecl-runkit-0.9/runkit/runkit.c:128:2: 
warning: (near initialization for 'runkit_functions[21]') [enabled by default]
/home/fedora/hubbitus/rpmbuild/BUILD/php-pecl-runkit-0.9/runkit/runkit.c:128:2: 
warning: excess elements in scalar initializer [enabled by default]
/home/fedora/hubbitus/rpmbuild/BUILD/php-pecl-runkit-0.9/runkit/runkit.c:128:2: 
warning: (near initialization for 'runkit_functions[21]') [enabled by default]
/home/fedora/hubbitus/rpmbuild/BUILD/php-pecl-runkit-0.9/runkit/runkit.c:139:2: 
warning: initialization from incompatible pointer type [enabled by default]
/home/fedora/hubbitus/rpmbuild/BUILD/php-pecl-runkit-0.9/runkit/runkit.c:139:2: 
warning: (near initialization for 'runkit_module_entry.functions') [enabled by 
default]
/home/fedora/hubbitus/rpmbuild/BUILD/php-pecl-runkit-0.9/runkit/runkit.c: In 
function 'php_runkit_register_auto_global':
/home/fedora/hubbitus/rpmbuild/BUILD/php-pecl-runkit-0.9/runkit/runkit.c:287:2: 
warning: passing argument 3 of 'zend_register_auto_global' makes integer from 
pointer without a cast [enabled by default]
In file included from /usr/include/php/Zend/zend_modules.h:26:0,
                 from /usr/include/php/Zend/zend_API.h:26,
                 from /usr/include/php/main/php.h:38,
                 from /home/fedora/hubbitus/rpmbuild/BUILD/php-pecl-runkit-
0.9/runkit/php_runkit.h:28,
                 from /home/fedora/hubbitus/rpmbuild/BUILD/php-pecl-runkit-
0.9/runkit/runkit.c:21:
/usr/include/php/Zend/zend_compile.h:685:45: note: expected 'zend_bool' but 
argument is of type 'void *'
/home/fedora/hubbitus/rpmbuild/BUILD/php-pecl-runkit-0.9/runkit/runkit.c:287:2: 
error: too few arguments to function 'zend_register_auto_global'
In file included from /usr/include/php/Zend/zend_modules.h:26:0,
                 from /usr/include/php/Zend/zend_API.h:26,
                 from /usr/include/php/main/php.h:38,
                 from /home/fedora/hubbitus/rpmbuild/BUILD/php-pecl-runkit-
0.9/runkit/php_runkit.h:28,
                 from /home/fedora/hubbitus/rpmbuild/BUILD/php-pecl-runkit-
0.9/runkit/runkit.c:21:
/usr/include/php/Zend/zend_compile.h:685:45: note: declared here
/home/fedora/hubbitus/rpmbuild/BUILD/php-pecl-runkit-0.9/runkit/runkit.c:290:3: 
warning: implicit declaration of function 'zend_auto_global_disable_jit' [-
Wimplicit-function-declaration]
/home/fedora/hubbitus/rpmbuild/BUILD/php-pecl-runkit-0.9/runkit/runkit.c: In 
function 'zm_deactivate_runkit':
/home/fedora/hubbitus/rpmbuild/BUILD/php-pecl-runkit-0.9/runkit/runkit.c:368:3: 
warning: passing argument 2 of 'zend_hash_apply' from incompatible pointer type 
[enabled by default]
In file included from /usr/include/php/Zend/zend.h:271:0,
                 from /usr/include/php/main/php.h:34,
                 from /home/fedora/hubbitus/rpmbuild/BUILD/php-pecl-runkit-
0.9/runkit/php_runkit.h:28,
                 from /home/fedora/hubbitus/rpmbuild/BUILD/php-pecl-runkit-
0.9/runkit/runkit.c:21:
/usr/include/php/Zend/zend_hash.h:138:46: note: expected 'apply_func_t' but 
argument is of type 'int (*)(char *)'
/home/fedora/hubbitus/rpmbuild/BUILD/php-pecl-runkit-0.9/runkit/runkit.c:378:3: 
warning: passing argument 2 of 'zend_hash_apply' from incompatible pointer type 
[enabled by default]
In file included from /usr/include/php/Zend/zend.h:271:0,
                 from /usr/include/php/main/php.h:34,
                 from /home/fedora/hubbitus/rpmbuild/BUILD/php-pecl-runkit-
0.9/runkit/php_runkit.h:28,
                 from /home/fedora/hubbitus/rpmbuild/BUILD/php-pecl-runkit-
0.9/runkit/runkit.c:21:
/usr/include/php/Zend/zend_hash.h:138:46: note: expected 'apply_func_t' but 
argument is of type 'int (*)(struct zend_hash_key *)'
/home/fedora/hubbitus/rpmbuild/BUILD/php-pecl-runkit-0.9/runkit/runkit.c:386:3: 
warning: passing argument 2 of 'zend_hash_apply_with_arguments' from 
incompatible pointer type [enabled by default]
In file included from /usr/include/php/Zend/zend.h:271:0,
                 from /usr/include/php/main/php.h:34,
                 from /home/fedora/hubbitus/rpmbuild/BUILD/php-pecl-runkit-
0.9/runkit/php_runkit.h:28,
                 from /home/fedora/hubbitus/rpmbuild/BUILD/php-pecl-runkit-
0.9/runkit/runkit.c:21:
/usr/include/php/Zend/zend_hash.h:140:46: note: expected 'apply_func_args_t' but 
argument is of type 'int (*)(struct zend_internal_function *, int,  struct 
__va_list_tag *, struct zend_hash_key *)'
make: *** [runkit.lo] Error 1


Patches

Add a Patch

Pull Requests

Add a Pull Request

History

AllCommentsChangesGit/SVN commitsRelated reports
 [2012-08-22 17:04 UTC] shtalinberg at gmail dot com
Hi.

I have the same problem, and can't use phpdaemon with php 5.4.6 until the problem isn't fixed


running: make
/bin/sh /var/tmp/pear-build-rootgXAppb/runkit-0.9/libtool --mode=compile cc  -I. -I/var/tmp/runkit -DPHP_ATOM_INC -I/var/tmp/pear-build-rootgXAppb/runkit-0.9/include -I/var/tmp/pear-build-rootgXAppb/runkit-0.9/main -I/var/tmp/runkit -I/usr/include/php -I/usr/include/php/main -I/usr/include/php/TSRM -I/usr/include/php/Zend -I/usr/include/php/ext -I/usr/include/php/ext/date/lib  -DHAVE_CONFIG_H  -g -O2   -c /var/tmp/runkit/runkit.c -o runkit.lo
libtool: compile:  cc -I. -I/var/tmp/runkit -DPHP_ATOM_INC -I/var/tmp/pear-build-rootgXAppb/runkit-0.9/include -I/var/tmp/pear-build-rootgXAppb/runkit-0.9/main -I/var/tmp/runkit -I/usr/include/php -I/usr/include/php/main -I/usr/include/php/TSRM -I/usr/include/php/Zend -I/usr/include/php/ext -I/usr/include/php/ext/date/lib -DHAVE_CONFIG_H -g -O2 -c /var/tmp/runkit/runkit.c  -fPIC -DPIC -o .libs/runkit.o
/var/tmp/runkit/runkit.c: In function ‘zif_runkit_zval_inspect’:
/var/tmp/runkit/runkit.c:61: error: ‘zval’ has no member named ‘refcount’
/var/tmp/runkit/runkit.c:62: error: ‘zval’ has no member named ‘is_ref’
/var/tmp/runkit/runkit.c: At top level:
/var/tmp/runkit/runkit.c:69: error: expected ‘=’, ‘,’, ‘;’, ‘asm’ or ‘__attribute__’ before ‘runkit_functions’
/var/tmp/runkit/runkit.c:131: error: ‘runkit_functions’ undeclared here (not in a function)
/var/tmp/runkit/runkit.c: In function ‘php_runkit_register_auto_global’:
/var/tmp/runkit/runkit.c:279: warning: passing argument 3 of ‘zend_register_auto_global’ makes integer from pointer without a cast
/usr/include/php/Zend/zend_compile.h:681: note: expected ‘zend_bool’ but argument is of type ‘void *’
/var/tmp/runkit/runkit.c:279: error: too few arguments to function ‘zend_register_auto_global’
/var/tmp/runkit/runkit.c: In function ‘zm_deactivate_runkit’:
/var/tmp/runkit/runkit.c:360: warning: passing argument 2 of ‘zend_hash_apply’ from incompatible pointer type
/usr/include/php/Zend/zend_hash.h:138: note: expected ‘apply_func_t’ but argument is of type ‘int (*)(char *)’
/var/tmp/runkit/runkit.c:370: warning: passing argument 2 of ‘zend_hash_apply’ from incompatible pointer type
/usr/include/php/Zend/zend_hash.h:138: note: expected ‘apply_func_t’ but argument is of type ‘int (*)(struct zend_hash_key *)’
/var/tmp/runkit/runkit.c:378: warning: passing argument 2 of ‘zend_hash_apply_with_arguments’ from incompatible pointer type
/usr/include/php/Zend/zend_hash.h:140: note: expected ‘apply_func_args_t’ but argument is of type ‘int (*)(struct zend_internal_function *, int,  struct __va_list_tag *, struct zend_hash_key *)’
make: *** [runkit.lo] Error 1
ERROR: `make' failed
 [2012-08-26 10:52 UTC] dzenovich@php.net
Runkit extension in PECL (0.9) is too old. The current version is hosted on http://github.com/zenovich/runkit
The PHP5.4.x will be supported as of version 1.4 of runkit. If you need runkit in PHP5.4 right now, please use the runkit from master branch of http://github.com/zenovich/runkit
 [2012-08-26 10:53 UTC] dzenovich@php.net
-Status: Open +Status: Closed -Assigned To: +Assigned To: dzenovich
 [2012-08-27 17:06 UTC] pahan at hubbitus dot info
Could you please clarify is github new scm place for development only, or that 
just fork of official old version?
 [2012-08-28 01:46 UTC] dzenovich@php.net
The official runkit is now hosted at http://github.com/zenovich/runkit
You can also download packages for previous releases from there.
 
PHP Copyright © 2001-2019 The PHP Group
All rights reserved.
Last updated: Sun Aug 25 06:01:27 2019 UTC