php.net |  support |  documentation |  report a bug |  advanced search |  search howto |  statistics |  random bug |  login
Bug #59849 APC fails to compile
Submitted: 2011-07-14 22:16 UTC Modified: 2011-08-15 11:27 UTC
From: evert at rooftopsolutions dot nl Assigned:
Status: Not a bug Package: APC (PECL)
PHP Version: 5.1.6 OS: CentOS
Private report: No CVE-ID: None
View Add Comment Developer Edit
Welcome! If you don't have a Git account, you can't do anything here.
You can add a comment by following this link or if you reported this bug, you can edit this bug over here.
Block user comment
Status: Assign to:
Package:
Bug Type:
Summary:
From: evert at rooftopsolutions dot nl
New email:
PHP Version: OS:

 

 [2011-07-14 22:16 UTC] evert at rooftopsolutions dot nl
Description:
------------
APC 3.1.9 fails to compile on CentOS with the following error:

/tmp/pear/temp/APC/apc.c:42:33: error: apc_php_pcre.h: No such file or directory

When I download and extract the package manually, the file does appear to be there.

Full output of make:

/bin/sh /var/tmp/pear-build-root/APC-3.1.9/libtool --mode=compile gcc  -I. -I/tmp/pear/temp/APC -DPHP_ATOM_INC -I/var/tmp/pear-build-root/APC-3.1.9/include -I/var/tmp/pear-build-root/APC-3.1.9/main -I/tmp/pear/temp/APC -I/usr/include/php -I/usr/include/php/main -I/usr/include/php/TSRM -I/usr/include/php/Zend -I/usr/include/php/ext  -DHAVE_CONFIG_H  -g -O2   -c /tmp/pear/temp/APC/apc.c -o apc.lo
mkdir .libs
 gcc -I. -I/tmp/pear/temp/APC -DPHP_ATOM_INC -I/var/tmp/pear-build-root/APC-3.1.9/include -I/var/tmp/pear-build-root/APC-3.1.9/main -I/tmp/pear/temp/APC -I/usr/include/php -I/usr/include/php/main -I/usr/include/php/TSRM -I/usr/include/php/Zend -I/usr/include/php/ext -DHAVE_CONFIG_H -g -O2 -c /tmp/pear/temp/APC/apc.c  -fPIC -DPIC -o .libs/apc.o
/tmp/pear/temp/APC/apc.c:42:33: error: apc_php_pcre.h: No such file or directory
/tmp/pear/temp/APC/apc.c:393: error: expected specifier-qualifier-list before 'pcre'
/tmp/pear/temp/APC/apc.c: In function 'apc_regex_compile_array':
/tmp/pear/temp/APC/apc.c:454: error: 'apc_regex' has no member named 'preg'
/tmp/pear/temp/APC/apc.c:454: error: 'apc_regex' has no member named 'preg'
/tmp/pear/temp/APC/apc.c:455: error: 'apc_regex' has no member named 'nreg'
/tmp/pear/temp/APC/apc.c:455: error: 'apc_regex' has no member named 'nreg'
/tmp/pear/temp/APC/apc.c: In function 'apc_regex_match_array':
/tmp/pear/temp/APC/apc.c:487: error: 'apc_regex' has no member named 'preg'
/tmp/pear/temp/APC/apc.c:487: error: 'apc_regex' has no member named 'preg'
/tmp/pear/temp/APC/apc.c:488: error: 'apc_regex' has no member named 'nreg'
/tmp/pear/temp/APC/apc.c:488: error: 'apc_regex' has no member named 'nreg'
make: *** [apc.lo] Error 1
ERROR: `make' failed


Patches

Add a Patch

Pull Requests

Add a Pull Request

History

AllCommentsChangesGit/SVN commitsRelated reports
 [2011-07-19 13:23 UTC] gabriele dot cicala at upprovider dot it
I had the same bug description on a Debian Etch .... while I try to upgrade from the 3.0.19 release to the new stable one 3.1.19
--------------
running: make
/bin/sh /tmp/pear/temp/pear-build-rootTpwmal/APC-3.1.9/libtool --mode=compile gcc  -I. -I/tmp/pear/temp/APC -DPHP_ATOM_INC -I/tmp/pear/temp/pear-build-rootTpwmal/APC-3.1.9/include -I/tmp/pear/temp/pear-build-rootTpwmal/APC-3.1.9/main -I/tmp/pear/temp/APC -I/usr/include/php5 -I/usr/include/php5/main -I/usr/include/php5/TSRM -I/usr/include/php5/Zend -I/usr/include/php5/ext -I/usr/include/php5/ext/date/lib -D_LARGEFILE_SOURCE -D_FILE_OFFSET_BITS=64  -DHAVE_CONFIG_H  -g -O2   -c /tmp/pear/temp/APC/apc.c -o apc.lo
mkdir .libs
 gcc -I. -I/tmp/pear/temp/APC -DPHP_ATOM_INC -I/tmp/pear/temp/pear-build-rootTpwmal/APC-3.1.9/include -I/tmp/pear/temp/pear-build-rootTpwmal/APC-3.1.9/main -I/tmp/pear/temp/APC -I/usr/include/php5 -I/usr/include/php5/main -I/usr/include/php5/TSRM -I/usr/include/php5/Zend -I/usr/include/php5/ext -I/usr/include/php5/ext/date/lib -D_LARGEFILE_SOURCE -D_FILE_OFFSET_BITS=64 -DHAVE_CONFIG_H -g -O2 -c /tmp/pear/temp/APC/apc.c  -fPIC -DPIC -o .libs/apc.o
/tmp/pear/temp/APC/apc.c:42:33: error: apc_php_pcre.h: No such file or directory
/tmp/pear/temp/APC/apc.c:393: error: expected specifier-qualifier-list before 'pcre'
/tmp/pear/temp/APC/apc.c: In function 'apc_regex_compile_array':
/tmp/pear/temp/APC/apc.c:454: error: 'apc_regex' has no member named 'preg'
/tmp/pear/temp/APC/apc.c:454: error: 'apc_regex' has no member named 'preg'
/tmp/pear/temp/APC/apc.c:455: error: 'apc_regex' has no member named 'nreg'
/tmp/pear/temp/APC/apc.c:455: error: 'apc_regex' has no member named 'nreg'
/tmp/pear/temp/APC/apc.c: In function 'apc_regex_match_array':
/tmp/pear/temp/APC/apc.c:487: error: 'apc_regex' has no member named 'preg'
/tmp/pear/temp/APC/apc.c:487: error: 'apc_regex' has no member named 'preg'
/tmp/pear/temp/APC/apc.c:488: error: 'apc_regex' has no member named 'nreg'
/tmp/pear/temp/APC/apc.c:488: error: 'apc_regex' has no member named 'nreg'
make: *** [apc.lo] Error 1

--------------
 [2011-07-26 08:45 UTC] chiddu at gmail dot com
pear install pecl/apc


[root@domU-12-31-39-09-E5-E1 APC-3.1.9]# pear install 
pecl/apc
downloading APC-3.1.9.tgz ...
Starting to download APC-3.1.9.tgz (155,540 bytes)
.................................done: 155,540 bytes
54 source files, building
running: phpize
Configuring for:
PHP Api Version:         20090626
Zend Module Api No:      20090626
Zend Extension Api No:   220090626
config.m4:180: warning: AC_CACHE_VAL(PHP_APC_GCC_ATOMICS, 
...): suspicious cache-id, must contain _cv_ to be cached
../../lib/autoconf/general.m4:1974: AC_CACHE_VAL is expanded 
from...
../../lib/autoconf/general.m4:1994: AC_CACHE_CHECK is 
expanded from...
config.m4:180: the top level
config.m4:180: warning: AC_CACHE_VAL(PHP_APC_GCC_ATOMICS, 
...): suspicious cache-id, must contain _cv_ to be cached
../../lib/autoconf/general.m4:1974: AC_CACHE_VAL is expanded 
from...
../../lib/autoconf/general.m4:1994: AC_CACHE_CHECK is 
expanded from...
config.m4:180: the top level
Enable internal debugging in APC [no] : 
Enable per request file info about files used from the APC 
cache [no] : 
Enable spin locks (EXPERIMENTAL) [no] : 
Enable memory protection (EXPERIMENTAL) [no] : 
Enable pthread mutexes (default) [yes] : 
Enable pthread read/write locks (EXPERIMENTAL) [no] : 
building in /var/tmp/pear-build-root/APC-3.1.9
running: /var/tmp/APC/configure --enable-apc-debug=no --
enable-apc-filehits=no --enable-apc-spinlocks=no --enable-
apc-memprotect=no --enable-apc-pthreadmutex=yes --enable-
apc-pthreadrwlocks=no
checking for grep that handles long lines and -e... 
/bin/grep
checking for egrep... /bin/grep -E
checking for a sed that does not truncate output... /bin/sed
checking for cc... cc
checking for C compiler default output file name... a.out
checking whether the C compiler works... yes
checking whether we are cross compiling... no
checking for suffix of executables...
checking for suffix of object files... o
checking whether we are using the GNU C compiler... yes
checking whether cc accepts -g... yes
checking for cc option to accept ISO C89... none needed
checking how to run the C preprocessor... cc -E
checking for icc... no
checking for suncc... no
checking whether cc understands -c and -o together... yes
checking for system library directory... lib
checking if compiler supports -R... no
checking if compiler supports -Wl,-rpath,... yes
checking build system type... i686-pc-linux-gnu
checking host system type... i686-pc-linux-gnu
checking target system type... i686-pc-linux-gnu
checking for PHP prefix... /usr
checking for PHP includes... -I/usr/include/php -
I/usr/include/php/main -I/usr/include/php/TSRM -
I/usr/include/php/Zend -I/usr/include/php/ext -
I/usr/include/php/ext/date/lib
checking for PHP extension directory... /usr/lib/php/modules
checking for PHP installed headers prefix... 
/usr/include/php
checking if debug is enabled... no
checking if zts is enabled... no
checking for re2c... no
configure: WARNING: You will need re2c 0.13.4 or later if 
you want to regenerate PHP parsers.
checking for gawk... gawk
checking whether to enable APC support... yes, shared
checking whether we should enable cache request file info... 
no
checking whether we should use mmap... yes
checking whether we should use semaphore locking instead of 
fcntl... no
checking whether we should use pthread mutex locking... yes
pthread mutexs are supported!
checking whether we should use pthread read/write locking... 
no
checking whether the target compiler supports builtin 
atomics... yes
checking whether we should use spin locks... no
checking whether we should enable memory protection... no
checking for zend_set_lookup_function_hook... no
checking for sigaction... yes
checking for union semun... no
checking whether we should enable valgrind support... 
checking for ANSI C header files... yes
checking for sys/types.h... yes
checking for sys/stat.h... yes
checking for stdlib.h... yes
checking for string.h... yes
checking for memory.h... yes
checking for strings.h... yes
checking for inttypes.h... yes
checking for stdint.h... yes
checking for unistd.h... yes
yes
checking valgrind/memcheck.h usability... no
checking valgrind/memcheck.h presence... no
checking for valgrind/memcheck.h... no
checking for shm_open in -lrt... yes
checking how to print strings... printf
checking for a sed that does not truncate output... (cached) 
/bin/sed
checking for fgrep... /bin/grep -F
checking for ld used by cc... /usr/bin/ld
checking if the linker (/usr/bin/ld) is GNU ld... yes
checking for BSD- or MS-compatible name lister (nm)... 
/usr/bin/nm -B
checking the name lister (/usr/bin/nm -B) interface... BSD 
nm
checking whether ln -s works... yes
checking the maximum length of command line arguments... 
1572864
checking whether the shell understands some XSI 
constructs... yes
checking whether the shell understands "+="... yes
checking for /usr/bin/ld option to reload object files... -r
checking for objdump... objdump
checking how to recognize dependent libraries... pass_all
checking for ar... ar
checking for strip... strip
checking for ranlib... ranlib
checking for gawk... (cached) gawk
checking command to parse /usr/bin/nm -B output from cc 
object... ok
checking for dlfcn.h... yes
checking for objdir... .libs
checking if cc supports -fno-rtti -fno-exceptions... no
checking for cc option to produce PIC... -fPIC -DPIC
checking if cc PIC flag -fPIC -DPIC works... yes
checking if cc static flag -static works... no
checking if cc supports -c -o file.o... yes
checking if cc supports -c -o file.o... (cached) yes
checking whether the cc linker (/usr/bin/ld) supports shared 
libraries... yes
checking whether -lc should be explicitly linked in... no
checking dynamic linker characteristics... GNU/Linux ld.so
checking how to hardcode library paths into programs... 
immediate
checking whether stripping libraries is possible... yes
checking if libtool supports shared libraries... yes
checking whether to build shared libraries... yes
checking whether to build static libraries... no
configure: creating ./config.status
config.status: creating config.h
config.status: executing libtool commands
running: make
/bin/sh /var/tmp/pear-build-root/APC-3.1.9/libtool --
mode=compile cc  -I. -I/var/tmp/APC -DPHP_ATOM_INC -
I/var/tmp/pear-build-root/APC-3.1.9/include -I/var/tmp/pear-
build-root/APC-3.1.9/main -I/var/tmp/APC -I/usr/include/php 
-I/usr/include/php/main -I/usr/include/php/TSRM -
I/usr/include/php/Zend -I/usr/include/php/ext -
I/usr/include/php/ext/date/lib  -DHAVE_CONFIG_H  -g -O2   -c 
/var/tmp/APC/apc.c -o apc.lo
libtool: compile:  cc -I. -I/var/tmp/APC -DPHP_ATOM_INC -
I/var/tmp/pear-build-root/APC-3.1.9/include -I/var/tmp/pear-
build-root/APC-3.1.9/main -I/var/tmp/APC -I/usr/include/php 
-I/usr/include/php/main -I/usr/include/php/TSRM -
I/usr/include/php/Zend -I/usr/include/php/ext -
I/usr/include/php/ext/date/lib -DHAVE_CONFIG_H -g -O2 -c 
/var/tmp/APC/apc.c  -fPIC -DPIC -o .libs/apc.o
In file included from /var/tmp/APC/apc.c:44:
/usr/include/php/ext/pcre/php_pcre.h:29:18: error: pcre.h: 
No such file or directory
In file included from /var/tmp/APC/apc.c:44:
/usr/include/php/ext/pcre/php_pcre.h:37: error: expected 
'=', ',', ';', 'asm' or '__attribute__' before '*' token
/usr/include/php/ext/pcre/php_pcre.h:38: error: expected 
'=', ',', ';', 'asm' or '__attribute__' before '*' token
/usr/include/php/ext/pcre/php_pcre.h:44: error: expected 
specifier-qualifier-list before 'pcre'
/var/tmp/APC/apc.c:393: error: expected specifier-qualifier-
list before 'pcre'
/var/tmp/APC/apc.c: In function 'apc_regex_compile_array':
/var/tmp/APC/apc.c:454: error: 'apc_regex' has no member 
named 'preg'
/var/tmp/APC/apc.c:454: error: 'apc_regex' has no member 
named 'preg'
/var/tmp/APC/apc.c:455: error: 'apc_regex' has no member 
named 'nreg'
/var/tmp/APC/apc.c:455: error: 'apc_regex' has no member 
named 'nreg'
/var/tmp/APC/apc.c: In function 'apc_regex_match_array':
/var/tmp/APC/apc.c:487: error: 'apc_regex' has no member 
named 'preg'
/var/tmp/APC/apc.c:487: error: 'apc_regex' has no member 
named 'preg'
/var/tmp/APC/apc.c:488: error: 'apc_regex' has no member 
named 'nreg'
/var/tmp/APC/apc.c:488: error: 'apc_regex' has no member 
named 'nreg'
make: *** [apc.lo] Error 1
ERROR: `make' failed
 [2011-08-15 11:27 UTC] pierre dot php at gmail dot com
Install the PCRE support as well.
 [2011-09-12 08:23 UTC] ned at seagoon dot com
Dependency on pcre-devel is expressly contradicted by the 
official php docs: 
http://uk.php.net/manual/en/apc.requirements.php
 [2013-07-08 12:59 UTC] boksiora at gmail dot com
I have the same problem in Centos 64 bit
 [2014-02-08 09:10 UTC] berkut at pravda dot ru
$ yum install pcre-devel

Then

pear install pecl/apc
 
PHP Copyright © 2001-2021 The PHP Group
All rights reserved.
Last updated: Sun Apr 11 21:01:26 2021 UTC