|  support |  documentation |  report a bug |  advanced search |  search howto |  statistics |  random bug |  login
Bug #56186 unable to compile module
Submitted: 2004-09-06 08:23 UTC Modified: 2012-03-31 02:03 UTC
From: erkib at cheerful dot com Assigned: yohgaki (profile)
Status: Closed Package: BLENC (PECL)
PHP Version: 4.3.3 OS: Suse 9.0
Private report: No CVE-ID: None
View Add Comment Developer Edit
Anyone can comment on a bug. Have a simpler test case? Does it work for you on a different platform? Let us know!
Just going to say 'Me too!'? Don't clutter the database with that please !
Your email address:
Solve the problem:
5 + 12 = ?
Subscribe to this entry?

 [2004-09-06 08:23 UTC] erkib at cheerful dot com
issuing a 'make' command results in compile error:

blenc-1.0alpha/blenc.c: In function `zm_startup_blenc':
blenc-1.0alpha/blenc.c:101: warning: passing arg 4 of `zend_hash_init' from incompatible pointer type
blenc-1.0alpha/blenc.c: In function `blenc_compile':
blenc-1.0alpha/blenc.c:461: error: union has no member named `stream'
blenc-1.0alpha/blenc.c:462: error: union has no member named `stream'
blenc-1.0alpha/blenc.c:464: error: union has no member named `stream'
blenc-1.0alpha/blenc.c:465: error: union has no member named `stream'
blenc-1.0alpha/blenc.c:469: error: union has no member named `stream'
make: *** [blenc.lo] Error 1


Add a Patch

Pull Requests

Add a Pull Request


AllCommentsChangesGit/SVN commitsRelated reports
 [2012-03-31 02:03 UTC]
I think BLENC is obsolete now.
 [2012-03-31 02:03 UTC]
-Status: Open +Status: Closed -Assigned To: +Assigned To: yohgaki
PHP Copyright © 2001-2020 The PHP Group
All rights reserved.
Last updated: Sun Jul 12 14:01:25 2020 UTC