php.net |  support |  documentation |  report a bug |  advanced search |  search howto |  statistics |  random bug |  login
Bug #10655 make fails with apache "Undefined simbol isinf"
Submitted: 2001-05-03 20:46 UTC Modified: 2001-05-03 22:24 UTC
From: grisha at kasenna dot com Assigned:
Status: Closed Package: Compile Failure
PHP Version: 4.0.5 OS: Solaris 8
Private report: No CVE-ID: None
View Add Comment Developer Edit
Anyone can comment on a bug. Have a simpler test case? Does it work for you on a different platform? Let us know!
Just going to say 'Me too!'? Don't clutter the database with that please !
Your email address:
MUST BE VALID
Solve the problem:
22 + 8 = ?
Subscribe to this entry?

 
 [2001-05-03 20:46 UTC] grisha at kasenna dot com
php configured:
./configure --with-apache=/export/home/grisha/apache/apache_1.3.19 --enable-sockets --with-domxml=/usr/local/lib --with-sablot=/usr/local/lib --with-xml --enable-sablot-errors-descriptive
make and make install succesfull
apache configured:
./configure --activate-module=src/modules/php4/libphp4.a

then make in apache_1.3.19 fails with the message:

am  -ldl -lexpat -lsablot -lresolv -lresolv -lm -ldl -lcrypt -lnsl -lsocket  -lsocket -lgcc   -lsocket -lnsl

Undefined                       first referenced
 symbol                             in file
isinf                               modules/php4/libphp4.a(formatted_print.o)
ld: fatal: Symbol referencing errors. No output written to httpd
collect2: ld returned 1 exit status
make[2]: *** [target_static] Error 1
make[2]: Leaving directory `/export/home/grisha/apache/apache_1.3.19/src'
make[1]: *** [build-std] Error 2
make[1]: Leaving directory `/export/home/grisha/apache/apache_1.3.19'
make: *** [build] Error 2

Patches

Add a Patch

Pull Requests

Add a Pull Request

 
PHP Copyright © 2001-2024 The PHP Group
All rights reserved.
Last updated: Fri Jun 14 11:01:34 2024 UTC