php.net |  support |  documentation |  report a bug |  advanced search |  search howto |  statistics |  random bug |  login
Bug #7682 ./zend-scanner.l:1002: `ERANGE' undeclared
Submitted: 2000-11-07 16:36 UTC Modified: 2000-11-08 01:04 UTC
From: gallard dot nicolas at cimaest dot msa dot fr Assigned:
Status: Closed Package: Compile Failure
PHP Version: 4.0.2 OS: Mandrake 7.02
Private report: No CVE-ID: None
Welcome back! If you're the original bug submitter, here's where you can edit the bug or add additional notes.
If you forgot your password, you can retrieve your password here.
Password:
Status:
Package:
Bug Type:
Summary:
From: gallard dot nicolas at cimaest dot msa dot fr
New email:
PHP Version: OS:

 

 [2000-11-07 16:36 UTC] gallard dot nicolas at cimaest dot msa dot fr
In compiling, i have this error :

[root@linux php-4.0.2]# ./configure   ---> it's OK (i things)
[root@linux php-4.0.2]# make
Making all in Zend
make[1]: Entering directory `/usr/local/src/php-4.0.2/Zend'
/bin/sh ../libtool --silent --mode=compile gcc -DHAVE_CONFIG_H -I. -I. -I..   -D
XML_BYTE_ORDER=12  -g -O2 -c zend-scanner.c
./zend-scanner.l: In function `lex_scan':
./zend-scanner.l:1002: `ERANGE' undeclared (first use in this function)
./zend-scanner.l:1002: (Each undeclared identifier is reported only once
./zend-scanner.l:1002: for each function it appears in.)
make[1]: *** [zend-scanner.lo] Error 1
make[1]: Leaving directory `/usr/local/src/php-4.0.2/Zend'
make: *** [all-recursive] Error 1

Patches

Pull Requests

History

AllCommentsChangesGit/SVN commitsRelated reports
 [2000-11-07 17:23 UTC] gallard dot nicolas at cimaest dot msa dot fr
In compiling, i have this error :

[root@linux php-4.0.2]# ./configure   ---> it's OK (i thinks)
[root@linux php-4.0.2]# make
Making all in Zend
make[1]: Entering directory `/usr/local/src/php-4.0.2/Zend'
/bin/sh ../libtool --silent --mode=compile gcc -DHAVE_CONFIG_H -I. -I. -I..   -D
XML_BYTE_ORDER=12  -g -O2 -c zend-scanner.c
./zend-scanner.l: In function `lex_scan':
./zend-scanner.l:1002: `ERANGE' undeclared (first use in this function)
./zend-scanner.l:1002: (Each undeclared identifier is reported only once
./zend-scanner.l:1002: for each function it appears in.)
make[1]: *** [zend-scanner.lo] Error 1
make[1]: Leaving directory `/usr/local/src/php-4.0.2/Zend'
make: *** [all-recursive] Error 1
 [2000-11-08 01:04 UTC] sniper@php.net
See #6415

(And please upgrade to PHP4.0.3pl1 !)

--Jani

 
PHP Copyright © 2001-2026 The PHP Group
All rights reserved.
Last updated: Sun Oct 11 17:00:01 2026 UTC