php.net |  support |  documentation |  report a bug |  advanced search |  search howto |  statistics |  random bug |  login
Bug #7201 make fails
Submitted: 2000-10-13 21:33 UTC Modified: 2000-10-13 22:06 UTC
From: dan at tucny dot com Assigned:
Status: Closed Package: Compile Failure
PHP Version: 4.0.3 OS: Redhat 6.1
Private report: No CVE-ID: None
Welcome back! If you're the original bug submitter, here's where you can edit the bug or add additional notes.
If you forgot your password, you can retrieve your password here.
Password:
Status:
Package:
Bug Type:
Summary:
From: dan at tucny dot com
New email:
PHP Version: OS:

 

 [2000-10-13 21:33 UTC] dan at tucny dot com
/bin/sh /home/dan/php-4.0.3/libtool --silent --mode=compile gcc  -I. -I/home/dan/php-4.0.3/ext/standard -I/home/dan/php-4.0.3 -I/home/dan/php-4.0.3/main -I/usr/include/apache -I/home/dan/php-4.0.3/Zend -I/home/dan/php-4.0.3 -I/home/dan/php-4.0.3/ext/mysql/libmysql -I/home/dan/php-4.0.3/ext/xml/expat/xmltok -I/home/dan/php-4.0.3/ext/xml/expat/xmlparse -I/home/dan/php-4.0.3/TSRM  -DXML_BYTE_ORDER=12 -g -O2  -c microtime.c
microtime.c: In function `php_if_getrusage':
microtime.c:97: storage size of `usg' isn't known
microtime.c:100: `RUSAGE_SELF' undeclared (first use in this function)
microtime.c:100: (Each undeclared identifier is reported only once
microtime.c:100: for each function it appears in.)
microtime.c:106: `RUSAGE_CHILDREN' undeclared (first use in this function)
make[3]: *** [microtime.lo] Error 1
make[3]: Leaving directory `/home/dan/php-4.0.3/ext/standard'
make[2]: *** [all-recursive] Error 1
make[2]: Leaving directory `/home/dan/php-4.0.3/ext/standard'
make[1]: *** [all-recursive] Error 1
make[1]: Leaving directory `/home/dan/php-4.0.3/ext'
make: *** [all-recursive] Error 1

php4.0.1pl2 compiles ok

Patches

Pull Requests

History

AllCommentsChangesGit/SVN commitsRelated reports
 
PHP Copyright © 2001-2026 The PHP Group
All rights reserved.
Last updated: Sat Oct 10 10:00:02 2026 UTC