php.net |  support |  documentation |  report a bug |  advanced search |  search howto |  statistics |  random bug |  login
Bug #5967 Can't compile with mcrypt
Submitted: 2000-08-04 16:43 UTC Modified: 2000-08-04 16:46 UTC
From: pniklas at bigfoot dot com Assigned:
Status: Closed Package: Compile Failure
PHP Version: 4.0.1pl2 OS: Mandrake 7.1
Private report: No CVE-ID: None
Welcome back! If you're the original bug submitter, here's where you can edit the bug or add additional notes.
If you forgot your password, you can retrieve your password here.
Password:
Status:
Package:
Bug Type:
Summary:
From: pniklas at bigfoot dot com
New email:
PHP Version: OS:

 

 [2000-08-04 16:43 UTC] pniklas at bigfoot dot com
mcrypt.c:115: warning: `MCRYPT_FAILED' redefined
/usr/local/include/mcrypt.h:28: warning: this is the location of the previous definition
mcrypt.c: In function `php_minit_mcrypt':
mcrypt.c:134: `MCRYPT_BLOWFISH_448' undeclared (first use in this function)
mcrypt.c:134: (Each undeclared identifier is reported only once
mcrypt.c:134: for each function it appears in.)
mcrypt.c:135: warning: passing arg 3 of `zend_register_long_constant' makes integer from pointer witho
ut a cast
mcrypt.c:136: warning: passing arg 3 of `zend_register_long_constant' makes integer from pointer witho
ut a cast
mcrypt.c:137: warning: passing arg 3 of `zend_register_long_constant' makes integer from pointer witho
ut a cast
mcrypt.c:138: warning: passing arg 3 of `zend_register_long_constant' makes integer from pointer witho
ut a cast
mcrypt.c:139: `MCRYPT_SAFER_64' undeclared (first use in this function)
mcrypt.c:140: `MCRYPT_SAFER_128' undeclared (first use in this function)
mcrypt.c:141: warning: passing arg 3 of `zend_register_long_constant' makes integer from pointer witho
ut a cast
mcrypt.c:142: warning: passing arg 3 of `zend_register_long_constant' makes integer from pointer witho
ut a cast
mcrypt.c:143: `MCRYPT_RC2_1024' undeclared (first use in this function)
mcrypt.c:144: `MCRYPT_TWOFISH_128' undeclared (first use in this function)
mcrypt.c:145: `MCRYPT_TWOFISH_192' undeclared (first use in this function)
mcrypt.c:146: `MCRYPT_TWOFISH_256' undeclared (first use in this function)
mcrypt.c:147: `MCRYPT_BLOWFISH_128' undeclared (first use in this function)
mcrypt.c:148: `MCRYPT_BLOWFISH_192' undeclared (first use in this function)
mcrypt.c:149: `MCRYPT_BLOWFISH_256' undeclared (first use in this function)
mcrypt.c:150: warning: passing arg 3 of `zend_register_long_constant' makes integer from pointer witho
ut a cast
mcrypt.c:151: warning: passing arg 3 of `zend_register_long_constant' makes integer from pointer witho
ut a cast
mcrypt.c:152: warning: passing arg 3 of `zend_register_long_constant' makes integer from pointer witho
ut a cast
mcrypt.c:153: `MCRYPT_SERPENT_128' undeclared (first use in this function)
mcrypt.c:154: `MCRYPT_SERPENT_192' undeclared (first use in this function)
mcrypt.c:155: `MCRYPT_SERPENT_256' undeclared (first use in this function)
mcrypt.c:156: warning: passing arg 3 of `zend_register_long_constant' makes integer from pointer witho
ut a cast
mcrypt.c:157: warning: passing arg 3 of `zend_register_long_constant' makes integer from pointer witho
ut a cast
mcrypt.c:158: warning: passing arg 3 of `zend_register_long_constant' makes integer from pointer witho
ut a cast
mcrypt.c:159: `MCRYPT_RC2_256' undeclared (first use in this function)
mcrypt.c:160: `MCRYPT_RC2_128' undeclared (first use in this function)
mcrypt.c:161: `MCRYPT_RC6_256' undeclared (first use in this function)
mcrypt.c:162: `MCRYPT_IDEA' undeclared (first use in this function)
mcrypt.c:163: `MCRYPT_RC6_128' undeclared (first use in this function)
mcrypt.c:164: `MCRYPT_RC6_192' undeclared (first use in this function)
mcrypt.c:165: `MCRYPT_RC4' undeclared (first use in this function)
mcrypt.c: In function `php_if_mcrypt_get_cipher_name':
mcrypt.c:241: warning: assignment makes pointer from integer without a cast
make[3]: *** [mcrypt.lo] Error 1
make[3]: Leaving directory `/usr/src/php-4.0.1pl2/ext/mcrypt'
make[2]: *** [all-recursive] Error 1
make[2]: Leaving directory `/usr/src/php-4.0.1pl2/ext/mcrypt'
make[1]: *** [all-recursive] Error 1
make[1]: Leaving directory `/usr/src/php-4.0.1pl2/ext'
make: *** [all-recursive] Error 1
[root@voyager php-4.0.1pl2]# }                                                                                             

Patches

Pull Requests

History

AllCommentsChangesGit/SVN commitsRelated reports
 [2000-08-04 16:46 UTC] rasmus@php.net
This is a known issue.  Only mcrypt 2.2.x is supported currently.  4.0.2 will have support for the latest versions of mcrypt.
 
PHP Copyright © 2001-2026 The PHP Group
All rights reserved.
Last updated: Sat Oct 10 11:00:01 2026 UTC