php.net |  support |  documentation |  report a bug |  advanced search |  search howto |  statistics |  random bug |  login
Bug #5946 microtime.c error while running make
Submitted: 2000-08-03 19:00 UTC Modified: 2000-08-06 03:15 UTC
From: jim at ohio dot com Assigned:
Status: Closed Package: Installation problem
PHP Version: 4.0.1pl2 OS: Slackware 7 kernel 2.2.16
Private report: No CVE-ID: None
Welcome back! If you're the original bug submitter, here's where you can edit the bug or add additional notes.
If you forgot your password, you can retrieve your password here.
Password:
Status:
Package:
Bug Type:
Summary:
From: jim at ohio dot com
New email:
PHP Version: OS:

 

 [2000-08-03 19:00 UTC] jim at ohio dot com
i have tried to install static and dso to no avail but this always happens:

opus:/tmp/stuff/php-4.0.1pl2# make
Making all in Zend ....

Blah blah blah (stuff flies across screen...)
until this comes up...

TE_ORDER=12 -g -O2  -c microtime.c && touch microtime.lo
microtime.c: In function `php_if_getrusage':
microtime.c:97: storage size of `usg' isn't known
microtime.c:100: `RUSAGE_SELF' undeclared (first use in this function)
microtime.c:100: (Each undeclared identifier is reported only once
microtime.c:100: for each function it appears in.)
microtime.c:106: `RUSAGE_CHILDREN' undeclared (first use in this
function)
make[3]: *** [microtime.lo] Error 1
make[3]: Leaving directory `/tmp/stuff/php-4.0.1pl2/ext/standard'
make[2]: *** [all-recursive] Error 1
make[2]: Leaving directory `/tmp/stuff/php-4.0.1pl2/ext/standard'
make[1]: *** [all-recursive] Error 1
make[1]: Leaving directory `/tmp/stuff/php-4.0.1pl2/ext'
make: *** [all-recursive] Error 1  

Patches

Pull Requests

History

AllCommentsChangesGit/SVN commitsRelated reports
 [2000-08-06 03:15 UTC] rasmus@php.net
This is not a PHP problem.  Your system's header files are messed up.

 
PHP Copyright © 2001-2026 The PHP Group
All rights reserved.
Last updated: Mon Oct 12 22:00:01 2026 UTC