php.net |  support |  documentation |  report a bug |  advanced search |  search howto |  statistics |  random bug |  login
Bug #4741 compiling php4 fails (can't find ssl.h and buffer.h) with Stronghold
Submitted: 2000-06-01 00:26 UTC Modified: 2000-08-05 00:26 UTC
From: mike at dice dot net Assigned:
Status: Closed Package: Compile Failure
PHP Version: 4.0 Release Candidate 2 OS: RedHat Linux 6.1 (kernel 2.2.12-
Private report: No CVE-ID: None
Welcome back! If you're the original bug submitter, here's where you can edit the bug or add additional notes.
If you forgot your password, you can retrieve your password here.
Password:
Status:
Package:
Bug Type:
Summary:
From: mike at dice dot net
New email:
PHP Version: OS:

 

 [2000-06-01 00:26 UTC] mike at dice dot net
This bug may be related to bug #3966 but reason for exit is different as far as I can tell.

I'm trying to install PHP on a server running Stronghold:

Server version: Stronghold/2.4.1 Apache/1.3.3 C2NetEU/2409 (Unix)
Server built:   Oct 21 1998 16:34:17

OS is: RedHat Linux 2.2.12-20 #1 Mon Sep 27 10:40:35 EDT 1999 i686 unknown

PHP configuration line:
./configure --with-mysql --with-apache=/usr/stronghold/

Started compiling using "make", encounters errors and quits.  Here are the last few lines from the compilation procedure:
-----------------------
In file included from sapi_apache.c:32:
/usr/stronghold/src/include/httpd.h:75: buffer.h: No such file or directory
/usr/stronghold/src/include/httpd.h:76: ssl.h: No such file or directory
make[3]: *** [sapi_apache.lo] Error 1
make[3]: Leaving directory `/home/mike/php/php-4.0.0/sapi/apache'
make[2]: *** [all-recursive] Error 1
make[2]: Leaving directory `/home/mike/php/php-4.0.0/sapi/apache'
make[1]: *** [all-recursive] Error 1
make[1]: Leaving directory `/home/mike/php/php-4.0.0/sapi'
make: *** [all-recursive] Error 1
-----------------------

ssl.h and buffer.h are located here:
/usr/stronghold/ssl/include/ssl.h
/usr/stronghold/ssl/include/buffer.h

I think it's looking for them in the src/include directory but they are in the ssl/include directory, I'm not sure if this is a Stronghold specific issue.

Patches

Pull Requests

History

AllCommentsChangesGit/SVN commitsRelated reports
 [2000-06-01 01:38 UTC] mike at dice dot net
Looks like it will compile fine after a small adjustment.

I edited the config_vars.mk file and added "-I/usr/stronghold/ssl/include" to the INCLUDES section.

Mike
 [2000-07-29 01:14 UTC] sniper@php.net
Is this bug report still valid?

--Jani
 [2000-08-05 00:26 UTC] sniper@php.net
No feedback from user.

--Jani
 [2011-05-16 17:44 UTC] dtajchreber@php.net
Automatic comment from SVN on behalf of dtajchreber
Revision: http://svn.php.net/viewvc/?view=revision&revision=311092
Log: Doc Bug #54752 - Missing default value in pg_result_status prototype - added default value for type in signature

http://lxr.php.net/opengrok/xref/PHP_5_3/ext/pgsql/pgsql.c#4741
 
PHP Copyright © 2001-2026 The PHP Group
All rights reserved.
Last updated: Sun Oct 11 10:00:01 2026 UTC