php.net |  support |  documentation |  report a bug |  advanced search |  search howto |  statistics |  random bug |  login
Bug #4156 Error compiling basic functions
Submitted: 2000-04-15 23:10 UTC Modified: 2000-04-27 13:43 UTC
From: delouw at bigfoot dot com Assigned:
Status: Closed Package: Compile Failure
PHP Version: 4.0 Release Candidate 1 OS: Suse 6.1 Kernel 2.2.14
Private report: No CVE-ID: None
Welcome back! If you're the original bug submitter, here's where you can edit the bug or add additional notes.
If you forgot your password, you can retrieve your password here.
Password:
Status:
Package:
Bug Type:
Summary:
From: delouw at bigfoot dot com
New email:
PHP Version: OS:

 

 [2000-04-15 23:10 UTC] delouw at bigfoot dot com
Folks,

I compiled PHP4rc1 on different machines running SuSE linux 6.3 and 6.4
now I tried on a older box with 6.1 updated with Kernel 2.2.14,
and gcc 2.95.2

Here is my config:

./configure \
--with-apxs=/usr/local/apache/bin/apxs \
--enable-versioning --with-mysql=/usr/local/mysql \ --enable-track-vars \
--with-imap=/usr/local/imap-4.7b \
--with-gd 

Thanks for helping,

rgds 

Luc de Louw


/bin/sh ../../libtool --silent --mode=compile gcc -DHAVE_CONFIG_H -I. -I/usr/local/php-4.0RC1/ext/standard -I../.. -I../../Zend -I/usr/local/php-4.0RC1 -I/usr/local/apache/include -I/usr/local/imap-4.7b/c-client -I/usr/local/mysql/include/mysql -I/usr/local/php-4.0RC1/ext/xml/expat/xmltok -I/usr/local/php-4.0RC1/ext/xml/expat/xmlparse  -DEAPI=1 
-DXML_BYTE_ORDER=12 -D_REENTRANT -g -O2 -Wall  -c basic_functions.c
basic_functions.c:324: `php_if_dl' undeclared here (not in a function)
basic_functions.c:324: initializer element is not constant
basic_functions.c:324: (near initialization for `basic_functions[201].handler')
basic_functions.c: In function `php_info_basic':
basic_functions.c:708: warning: implicit declaration of function `php_info_dl'
make[3]: *** [basic_functions.lo] Error 1
make[3]: Leaving directory `/usr/local/php-4.0RC1/ext/standard'
make[2]: *** [all-recursive] Error 1
make[2]: Leaving directory `/usr/local/php-4.0RC1/ext/standard'
make[1]: *** [all] Error 1
make[1]: Leaving directory `/usr/local/php-4.0RC1/ext'
make: *** [all-recursive] Error 1
blah:/usr/local/php-4.0RC1 # 

Patches

Pull Requests

History

AllCommentsChangesGit/SVN commitsRelated reports
 [2000-04-27 13:43 UTC] sas at cvs dot php dot net
Fixed in CVS
 
PHP Copyright © 2001-2026 The PHP Group
All rights reserved.
Last updated: Sun Oct 11 10:00:01 2026 UTC