php.net |  support |  documentation |  report a bug |  advanced search |  search howto |  statistics |  random bug |  login
Bug #4102 Failed to compile under Solaris 2.6
Submitted: 2000-04-11 10:19 UTC Modified: 2000-04-27 13:37 UTC
From: ag0ny at ag0ny dot com Assigned:
Status: Closed Package: Compile Failure
PHP Version: 4.0 Release Candidate 1 OS: SunOS sun00460 5.6 Generic_10518
Private report: No CVE-ID: None
Welcome back! If you're the original bug submitter, here's where you can edit the bug or add additional notes.
If you forgot your password, you can retrieve your password here.
Password:
Status:
Package:
Bug Type:
Summary:
From: ag0ny at ag0ny dot com
New email:
PHP Version: OS:

 

 [2000-04-11 10:19 UTC] ag0ny at ag0ny dot com
Output from 'make':

basic_functions.c:324: `php_if_dl' undeclared here (not in a function)
basic_functions.c:324: initializer element for `basic_functions[201].handler' is not constant
basic_functions.c: In function `php_info_basic':
basic_functions.c:708: warning: implicit declaration of function `php_info_dl'
make[3]: *** [basic_functions.lo] Error 1
make[3]: Leaving directory `/4gig/tmp/soft/php-4.0RC1/ext/standard'
make[2]: *** [all-recursive] Error 1
make[2]: Leaving directory `/4gig/tmp/soft/php-4.0RC1/ext/standard'
make[1]: *** [all] Error 1
make[1]: Leaving directory `/4gig/tmp/soft/php-4.0RC1/ext'
make: *** [all-recursive] Error 1

My configure line was:

./configure --with-mysql=/usr/local/mysql-3.22.27-sun-solaris2.6-sparc/ --with-apxs=/usr/local/etc/httpsd/bin/apxs

I'm running Apache 1.3.12 + mod_ssl 2.6.2 as a DSO module + mm-1.0.12 + OpenSSL 0.9.4.

Patches

Pull Requests

History

AllCommentsChangesGit/SVN commitsRelated reports
 [2000-04-27 13:37 UTC] sas at cvs dot php dot net
Fixed in CVS
 
PHP Copyright © 2001-2026 The PHP Group
All rights reserved.
Last updated: Sun Oct 11 15:00:01 2026 UTC