php.net |  support |  documentation |  report a bug |  advanced search |  search howto |  statistics |  random bug |  login
Bug #3947 php-4.0RC1 - Compile failure in basic_function.c
Submitted: 2000-03-28 12:38 UTC Modified: 2000-03-29 12:37 UTC
From: kannan_narayanan at hotmail dot com Assigned:
Status: Closed Package: Compile Failure
PHP Version: 4.0 Beta 4 Patch Level 1 OS: HP-UX10.20
Private report: No CVE-ID: None
Welcome back! If you're the original bug submitter, here's where you can edit the bug or add additional notes.
If you forgot your password, you can retrieve your password here.
Password:
Status:
Package:
Bug Type:
Summary:
From: kannan_narayanan at hotmail dot com
New email:
PHP Version: OS:

 

 [2000-03-28 12:38 UTC] kannan_narayanan at hotmail dot com
PHP 4.0 RC1 fails to compile on HP-UX10.20 .
The error message is as follows:

basic_functions.c:324: `php_if_dl' undeclared here (not in a function)
basic_functions.c:324: initializer element is not constant
basic_functions.c:324: (near initialization for `basic_functions[201].handler')
basic_functions.c: In function `php_info_basic':
basic_functions.c:708: warning: implicit declaration of function `php_info_dl'
gmake[3]: *** [basic_functions.lo] Error 1
gmake[3]: Leaving directory `/1a/home/rzzx59/downloads/php-4.0RC1/ext/standard'
gmake[2]: *** [all-recursive] Error 1
gmake[2]: Leaving directory `/1a/home/rzzx59/downloads/php-4.0RC1/ext/standard'
gmake[1]: *** [all] Error 1
gmake[1]: Leaving directory `/1a/home/rzzx59/downloads/php-4.0RC1/ext'
gmake: *** [all-recursive] Error 1

Patches

Pull Requests

History

AllCommentsChangesGit/SVN commitsRelated reports
 [2000-03-29 12:37 UTC] sas at cvs dot php dot net
Fixed in CVS. Thanks for your report.
 
PHP Copyright © 2001-2026 The PHP Group
All rights reserved.
Last updated: Tue Oct 13 13:00:01 2026 UTC