php.net |  support |  documentation |  report a bug |  advanced search |  search howto |  statistics |  random bug |  login
Bug #3645 Can't compile with Sybase 11.9.2 for Linux (DB/CT)
Submitted: 2000-02-27 22:59 UTC Modified: 2000-03-09 15:00 UTC
From: john-moore at iname dot com Assigned:
Status: Closed Package: Compile Failure
PHP Version: 4.0 Beta 4 Patch Level 1 OS: Red Hat 6.0 (Kernel 2.2.5-15)
Private report: No CVE-ID: None
Welcome back! If you're the original bug submitter, here's where you can edit the bug or add additional notes.
If you forgot your password, you can retrieve your password here.
Password:
Status:
Package:
Bug Type:
Summary:
From: john-moore at iname dot com
New email:
PHP Version: OS:

 

 [2000-02-27 22:59 UTC] john-moore at iname dot com
my configure command line
./configure --with-sybase=/opt/sybase-11.9.2 --with-apache=../apache_1.3.9 --with-mhash=/usr/local --with-mcrypt=/usr/local --enable-trans-sid

The error message is here 

make[2]: Entering directory `/home/users/mzh/inst/php-4.0b4pl1/ext/sybase'
make[3]: Entering directory `/home/users/mzh/inst/php-4.0b4pl1/ext/sybase'
gcc -DHAVE_CONFIG_H -I. -I/home/users/mzh/inst/php-4.0b4pl1/ext/sybase -I../.. -
I../../Zend -I/home/users/mzh/inst/php-4.0b4pl1 -I/home/users/mzh/inst/apache_1.
3.9/src/include -I/home/users/mzh/inst/apache_1.3.9/src/os/unix -I/usr/local/inc
lude -I/opt/sybase-11.9.2/include  -D_REENTRANT -g -O2 -Wall  -c sybase.c && tou
ch sybase.lo
sybase.c: In function `php_sybase_do_connect':
sybase.c:260: `list' undeclared (first use in this function)
sybase.c:260: (Each undeclared identifier is reported only once
sybase.c:260: for each function it appears in.)
sybase.c:261: `plist' undeclared (first use in this function)
sybase.c: In function `php_if_sybase_fetch_object':
sybase.c:952: warning: implicit declaration of function `php_sybase_fetch_hash'
sybase.c: At top level:
sybase.c:907: warning: `php_if_sybase_fetch_hash' defined but not used
make[3]: *** [sybase.lo] Error 1
make[3]: Leaving directory `/home/users/mzh/inst/php-4.0b4pl1/ext/sybase'
make[2]: *** [all-recursive] Error 1
make[2]: Leaving directory `/home/users/mzh/inst/php-4.0b4pl1/ext/sybase'
make[1]: *** [all] Error 1
make[1]: Leaving directory `/home/users/mzh/inst/php-4.0b4pl1/ext'
make: *** [all-recursive] Error 1 

Patches

Pull Requests

History

AllCommentsChangesGit/SVN commitsRelated reports
 [2000-03-02 11:00 UTC] joey at cvs dot php dot net
Can you try the newest CVS, or a snapshot?
http://snaps.php.net/
 [2000-03-09 15:00 UTC] joey at cvs dot php dot net
Should be fixed as of 
27 Feb 2000

Please try CVS or snapshot (http://snaps.php.net)
 
PHP Copyright © 2001-2026 The PHP Group
All rights reserved.
Last updated: Sat Oct 10 10:00:02 2026 UTC