php.net |  support |  documentation |  report a bug |  advanced search |  search howto |  statistics |  random bug |  login
Bug #3512 compiling --with-java fails on PHP4 CVS
Submitted: 2000-02-17 04:26 UTC Modified: 2000-02-23 08:58 UTC
From: yusufg at outblaze dot com Assigned:
Status: Closed Package: Compile Failure
PHP Version: 4.0 Latest CVS (17/02/2000) OS: Linux 2.2.12
Private report: No CVE-ID: None
Welcome back! If you're the original bug submitter, here's where you can edit the bug or add additional notes.
If you forgot your password, you can retrieve your password here.
Password:
Status:
Package:
Bug Type:
Summary:
From: yusufg at outblaze dot com
New email:
PHP Version: OS:

 

 [2000-02-17 04:26 UTC] yusufg at outblaze dot com
Platform, Linux 2.2.12 / redhat 6.0                                             
Sources in /usr/local/src/{php4,Zend,TSRM}                                      
Build tree in /usr/local/src/phpbuild                                           
Running the following configure command                                         
                                                                                
                                                                                
../php4/configure  --with-apache=/usr/local/src/apache_1.3.9 \                  
--with-mysql=/usr/local/site/mysql --enable-track-vars \                        
--enable-magic-quotes \                                                         
--with-db2=/usr/local/site/BerkeleyDB \                                         
--with-ldap=/usr/local/site/ldap \                                              
--with-java=/usr/local/site/jdk118 \                                            
--disable-debug --with-config-file-path=/usr/local/site/ \                      
--prefix=/usr/local/site/php                                                    

results in the following error                                                  
                                                                                
                                                                                
Making shared in java                                                           
make[2]: Entering directory `/usr/local/src/phpbuild/ext/java'                  
make[3]: Entering directory `/usr/local/src/phpbuild/ext/java'                  
cp: reflect.java: No such file or directory                                     
make[3]: *** [php_java.jar] Error 1                                             
make[3]: Leaving directory `/usr/local/src/phpbuild/ext/java'                   
make[2]: *** [shared] Error 2                                                   
make[2]: Leaving directory `/usr/local/src/phpbuild/ext/java'                   
make[1]: *** [all] Error 1                                                      
make[1]: Leaving directory `/usr/local/src/phpbuild/ext'                        
make: *** [all-recursive] Error 1

Patches

Pull Requests

History

AllCommentsChangesGit/SVN commitsRelated reports
 [2000-02-23 08:58 UTC] sas at cvs dot php dot net
Fixed in CVS.
 
PHP Copyright © 2001-2026 The PHP Group
All rights reserved.
Last updated: Sun Oct 11 15:00:01 2026 UTC