php.net |  support |  documentation |  report a bug |  advanced search |  search howto |  statistics |  random bug |  login
Bug #2783 libzend: conflicting types for `zendparse'
Submitted: 1999-11-21 01:44 UTC Modified: 1999-11-21 21:37 UTC
From: ide at ub dot uni-kl dot de Assigned:
Status: Closed Package: Compile Failure
PHP Version: 4.0 Beta 3 OS: SuSE Linux 6.2
Private report: No CVE-ID: None
Welcome back! If you're the original bug submitter, here's where you can edit the bug or add additional notes.
If you forgot your password, you can retrieve your password here.
Password:
Status:
Package:
Bug Type:
Summary:
From: ide at ub dot uni-kl dot de
New email:
PHP Version: OS:

 

 [1999-11-21 01:44 UTC] ide at ub dot uni-kl dot de
trying to compile php-4.0b3 with the following configuration:
./configure --enable-thread-safety --enable-sysvsem --enable-sysvshm --with-mm --with-mysql --with-ftp --with-apache=../apache_1.3.9
I get the following error message:

...
/bin/sh ./libtool --silent --mode=compile gcc -DHAVE_CONFIG_H -I. -I/opt/down/net/apache/php-4.0b3/./libzend -I.   -D_REENTRANT -D_POSIX_PTHREAD_SEMANTICS -I../TSRM  -O2 -march=pentiumpro -g -g -c -o zend-parser.lo zend-parser.c
/usr/lib/bison.simple:153: conflicting types for `zendparse'
zend_globals_macros.h:39: previous declaration of `zendparse'
/usr/lib/bison.simple: In function `zendparse':
/usr/lib/bison.simple:219: number of arguments doesn't match prototype
/usr/lib/bison.simple:153: prototype declaration
make[2]: *** [zend-parser.lo] Error 1
make[2]: Leaving directory `/usr/local/down/net/apache/php-4.0b3/libzend'
make[1]: *** [all-recursive] Error 1
make[1]: Leaving directory `/usr/local/down/net/apache/php-4.0b3'
make: *** [all-recursive-am] Error 2

Patches

Pull Requests

History

AllCommentsChangesGit/SVN commitsRelated reports
 [1999-11-21 21:37 UTC] sas at cvs dot php dot net
Remove --enable-thread-safety
 
PHP Copyright © 2001-2026 The PHP Group
All rights reserved.
Last updated: Sat Oct 10 11:00:01 2026 UTC