php.net |  support |  documentation |  report a bug |  advanced search |  search howto |  statistics |  random bug |  login
Bug #1816 cat't compile apache
Submitted: 1999-07-21 20:56 UTC Modified: 1999-07-22 09:16 UTC
From: talespin at kebi dot com Assigned:
Status: Closed Package: Installation problem
PHP Version: 4.0 Beta 1 OS: ultra linux (ultra sprac)
Private report: No CVE-ID: None
Welcome back! If you're the original bug submitter, here's where you can edit the bug or add additional notes.
If you forgot your password, you can retrieve your password here.
Password:
Status:
Package:
Bug Type:
Summary:
From: talespin at kebi dot com
New email:
PHP Version: OS:

 

 [1999-07-21 20:56 UTC] talespin at kebi dot com
apache make   outout
--------------------------------------------------------

===> src
make[1]: Entering directory `/root/apache_1.3.6'
make[2]: Entering directory `/root/apache_1.3.6/src'
===> src/regex
make[3]: Nothing to be done for `all'.
<=== src/regex
===> src/os/unix
gcc -c  -I../../os/unix -I../../include   -DLINUX=2 -I/root/php-4.0b1 -I/root/php-4.0b1/libzend -I/root/php-4.0b1/libzend -I/root/php-4.0b1 -DUSE_HSREGEX `../../apaci` os.c
gcc -c  -I../../os/unix -I../../include   -DLINUX=2 -I/root/php-4.0b1 -I/root/php-4.0b1/libzend -I/root/php-4.0b1/libzend -I/root/php-4.0b1 -DUSE_HSREGEX `../../apaci` os-inline.c
rm -f libos.a
ar cr libos.a os.o os-inline.o
ranlib libos.a
<=== src/os/unix
===> src/ap
gcc -c  -I../os/unix -I../include   -DLINUX=2 -I/root/php-4.0b1 -I/root/php-4.0b1/libzend -I/root/php-4.0b1/libzend -I/root/php-4.0b1 -DUSE_HSREGEX `../apaci` ap_execve.c
gcc -c  -I../os/unix -I../include   -DLINUX=2 -I/root/php-4.0b1 -I/root/php-4.0b1/libzend -I/root/php-4.0b1/libzend -I/root/php-4.0b1 -DUSE_HSREGEX `../apaci` ap_cpystrn.c
gcc -c  -I../os/unix -I../include   -DLINUX=2 -I/root/php-4.0b1 -I/root/php-4.0b1/libzend -I/root/php-4.0b1/libzend -I/root/php-4.0b1 -DUSE_HSREGEX `../apaci` ap_signal.c
gcc -c  -I../os/unix -I../include   -DLINUX=2 -I/root/php-4.0b1 -I/root/php-4.0b1/libzend -I/root/php-4.0b1/libzend -I/root/php-4.0b1 -DUSE_HSREGEX `../apaci` ap_slack.c
gcc -c  -I../os/unix -I../include   -DLINUX=2 -I/root/php-4.0b1 -I/root/php-4.0b1/libzend -I/root/php-4.0b1/libzend -I/root/php-4.0b1 -DUSE_HSREGEX `../apaci` ap_snprintf.c
gcc -c  -I../os/unix -I../include   -DLINUX=2 -I/root/php-4.0b1 -I/root/php-4.0b1/libzend -I/root/php-4.0b1/libzend -I/root/php-4.0b1 -DUSE_HSREGEX `../apaci` ap_fnmatch.c
gcc -c  -I../os/unix -I../include   -DLINUX=2 -I/root/php-4.0b1 -I/root/php-4.0b1/libzend -I/root/php-4.0b1/libzend -I/root/php-4.0b1 -DUSE_HSREGEX `../apaci` ap_md5c.c
rm -f libap.a
ar cr libap.a ap_execve.o ap_cpystrn.o ap_signal.o ap_slack.o ap_snprintf.o ap_fnmatch.o ap_md5c.o
ranlib libap.a
<=== src/ap
===> src/main
gcc -c  -I../os/unix -I../include   -DLINUX=2 -I/root/php-4.0b1 -I/root/php-4.0b1/libzend -I/root/php-4.0b1/libzend -I/root/php-4.0b1 -DUSE_HSREGEX `../apaci` gen_test_char.c
gcc  -DLINUX=2 -I/root/php-4.0b1 -I/root/php-4.0b1/libzend -I/root/php-4.0b1/libzend -I/root/php-4.0b1 -DUSE_HSREGEX `../apaci`   -o gen_test_char gen_test_char.o  -Lmodules/php4 -L../modules/php4 -L../../modules/php4 -lmodphp4 -L/root/php-4.0b1/ext/pcre/pcrelib -lpcre -L/root/php-4.0b1/regex -lregex  -lgdbm  -L/usr/local/lib/mysql -lmysqlclient     -lpam -ldl -lttf -lgd -lm -lcrypt -lnsl  -lresolv -rdynamic  -lm -lcrypt
./gen_test_char >test_char.h
make[2]: Leaving directory `/root/apache_1.3.6/src'
make[1]: Leaving directory `/root/apache_1.3.6'
make[3]: *** [util.o] Error 1make[2]: *** [subdirs] Error 1
make[2]: Leaving directory `/root/apache_1.3.6/src'
make[1]: *** [build-std] Error 2make[1]: Leaving directory `/root/apache_1.3.6'
make: *** [build] Error 2
--------------------------------------------------

Patches

Pull Requests

History

AllCommentsChangesGit/SVN commitsRelated reports
 [1999-07-22 08:08 UTC] ssb at cvs dot php dot net
Too little information.  Please provide your
configure commands for both PHP and Apache.

 [1999-07-22 09:16 UTC] sas at cvs dot php dot net
fixed in CVS

(rpaths are now correctly passed for normal programs, such as gen_test_path)
 
PHP Copyright © 2001-2026 The PHP Group
All rights reserved.
Last updated: Thu Oct 08 10:00:01 2026 UTC