php.net |  support |  documentation |  report a bug |  advanced search |  search howto |  statistics |  random bug |  login
Bug #1749 Compile fail on libzend
Submitted: 1999-07-20 11:34 UTC Modified: 1999-07-21 04:57 UTC
From: vasquezj at lilly dot com Assigned:
Status: Closed Package: Compile Failure
PHP Version: 4.0 Beta 1 OS: Linux i386 (Redhat 6.0 based)
Private report: No CVE-ID: None
Welcome back! If you're the original bug submitter, here's where you can edit the bug or add additional notes.
If you forgot your password, you can retrieve your password here.
Password:
Status:
Package:
Bug Type:
Summary:
From: vasquezj at lilly dot com
New email:
PHP Version: OS:

 

 [1999-07-20 11:34 UTC] vasquezj at lilly dot com
I compiled the php4 package with no problem, but when I went to compile the module into apache 1.3.6, the compile failed.  Here is an excerpt from the failure...

gcc -c  -I../os/unix -I../include   -DLINUX=2 -I/usr/local/src/php-4.0b1 -I/usr/local/src/php-4.0b1/libzend -I/usr/local/src/php-4.0b1/libzend -I/usr/local/src/php-4.0b1 -DUSE_HSREGEX `../apaci` util.c
util.c: In function `ap_find_token':
util.c:1292: `test_char_table' undeclared (first use in this function)
util.c:1292: (Each undeclared identifier is reported only once
util.c:1292: for each function it appears in.)
util.c:1292: `T_HTTP_TOKEN_STOP' undeclared (first use in this function)
util.c: In function `ap_escape_shell_cmd':
util.c:1351: `test_char_table' undeclared (first use in this function)
util.c:1351: `T_ESCAPE_SHELL_CMD' undeclared (first use in this function)
util.c: In function `ap_escape_path_segment':
util.c:1475: `test_char_table' undeclared (first use in this function)
util.c:1475: `T_ESCAPE_PATH_SEGMENT' undeclared (first use in this function)
util.c: In function `ap_os_escape_path':
util.c:1504: `test_char_table' undeclared (first use in this function)
util.c:1504: `T_OS_ESCAPE_PATH' undeclared (first use in this function)
make[3]: *** [util.o] Error 1
make[2]: *** [subdirs] Error 1
make[2]: Leaving directory `/usr/local/src/apache_1.3.6/src'
make[1]: *** [build-std] Error 2
make[1]: Leaving directory `/usr/local/src/apache_1.3.6'
make: *** [build] Error 2


I hope this helps!  Please let me know if you have any other questions about my setup.

Thanks,
-Jason Vasquez
vasquezj@lilly.com

Patches

Pull Requests

History

AllCommentsChangesGit/SVN commitsRelated reports
 [1999-07-21 04:57 UTC] sas at cvs dot php dot net
fixed in CVS
 
PHP Copyright © 2001-2026 The PHP Group
All rights reserved.
Last updated: Mon Oct 12 08:00:02 2026 UTC