php.net |  support |  documentation |  report a bug |  advanced search |  search howto |  statistics |  random bug |  login
Bug #7690 Compile failure in DOM-XML
Submitted: 2000-11-08 01:48 UTC Modified: 2000-11-08 03:19 UTC
From: graeme at inetix dot com dot au Assigned:
Status: Closed Package: Compile Failure
PHP Version: 4.0 Latest CVS (08/11/2000) OS: Linux i386 2.2.14
Private report: No CVE-ID: None
View Developer Edit
Welcome! If you don't have a Git account, you can't do anything here.
If you reported this bug, you can edit this bug over here.
(description)
Block user comment
Status: Assign to:
Package:
Bug Type:
Summary:
From: graeme at inetix dot com dot au
New email:
PHP Version: OS:

 

 [2000-11-08 01:48 UTC] graeme at inetix dot com dot au
RedHat 6.2 with libxml2-2.2.7-1.i386.rpm and libxml2-devel-2.2.7-1.i386.rpm from Gnome FTP server.

Configure line:
./configure '--with-mysql=/usr/local/mysql' '--with-oci8=/u01/app/oracle/product/8.1.5' '--disable-debug' '--enable-magic-quotes' '--without-gd' '--enable-memory-limit' '--enable-sigchild' '--with-dom'

Configure output:
checking for DOM support... yes
checking for DOM in default path... found in /usr

Make output:
gcc  -I. -I/usr/local/src/phpcvs/php4/ext/domxml -I/usr/local/src/phpcvs/php4 -I/usr/local/src/phpcvs/php4/main -I/usr/local/src/phpcvs/php4/Zend -I/usr/local/src/phpcvs/php4 -I/usr/local/mysql/include/mysql -I/u01/app/oracle/product/8.1.5/rdbms/demo -I/u01/app/oracle/product/8.1.5/network/public -I/u01/app/oracle/product/8.1.5/plsql/public -I/usr/local/src/phpcvs/php4/ext/xml/expat/xmltok -I/usr/local/src/phpcvs/php4/ext/xml/expat/xmlparse -I/usr/local/src/phpcvs/php4/TSRM  -DXML_BYTE_ORDER=12 -g -O2  -c php_domxml.c && touch php_domxml.lo
php_domxml.c: In function `php_minit_domxml':
php_domxml.c:168: `XML_GLOBAL_NAMESPACE' undeclared (first use in this function)
php_domxml.c:168: (Each undeclared identifier is reported only once
php_domxml.c:168: for each function it appears in.)
make[3]: *** [php_domxml.lo] Error 1
make[3]: Leaving directory `/usr/local/src/phpcvs/php4/ext/domxml'
make[2]: *** [all-recursive] Error 1
make[2]: Leaving directory `/usr/local/src/phpcvs/php4/ext/domxml'
make[1]: *** [all-recursive] Error 1
make[1]: Leaving directory `/usr/local/src/phpcvs/php4/ext'
make: *** [all-recursive] Error 1


Patches

Pull Requests

History

AllCommentsChangesGit/SVN commitsRelated reports
 [2000-11-08 03:19 UTC] sniper@php.net
Fixed in CVS now. Thanks.

--Jani
 
PHP Copyright © 2001-2026 The PHP Group
All rights reserved.
Last updated: Mon Oct 12 08:00:02 2026 UTC