php.net |  support |  documentation |  report a bug |  advanced search |  search howto |  statistics |  random bug |  login
Bug #6548 cvs broken
Submitted: 2000-09-05 07:18 UTC Modified: 2000-09-05 20:14 UTC
From: wico at cnh dot nl Assigned:
Status: Closed Package: Compile Failure
PHP Version: 4.0 Latest CVS (05/09/2000) OS: linux rh6
Private report: No CVE-ID: None
View Developer Edit
Welcome! If you don't have a Git account, you can't do anything here.
If you reported this bug, you can edit this bug over here.
(description)
Block user comment
Status: Assign to:
Package:
Bug Type:
Summary:
From: wico at cnh dot nl
New email:
PHP Version: OS:

 

 [2000-09-05 07:18 UTC] wico at cnh dot nl
<=== src/modules/ssl
===> src/modules/php4
gcc -c  -I../../os/unix -I../../include -I/usr/local/ssl/include   -DLINUX=2 -DTARGET=\"httpsd\" -I/usr/src/php4 -I/usr/src/php4/main -I/usr/src/php4/main -I/usr/src/php4/Zend -I/usr/src/php4/Zend -I/usr/src/php4 -DUSE_EXPAT -I../../lib/expat-lite -DNO_DL_NEEDED -DAPACHE_SSL `../../apaci`  mod_php4.c
In file included from mod_php4.c:29:
/usr/src/php4/main/php.h:294: tsrm_virtual_cwd.h: No such file or directory
make[4]: *** [mod_php4.o] Error 1
make[3]: *** [all] Error 1
make[2]: *** [subdirs] Error 1
make[2]: Leaving directory `/usr/src/apache_1.3.12/src'
make[1]: *** [build-std] Error 2
make[1]: Leaving directory `/usr/src/apache_1.3.12'
make: *** [build] Error 2

greetz,

wico

Patches

Pull Requests

History

AllCommentsChangesGit/SVN commitsRelated reports
 [2000-09-05 20:14 UTC] sniper@php.net
Please do a new checkout (to be sure) of php4, Zend and TSRM.

And in the future please use php-dev@lists.php.net for this kind
of 'bug' reports. Thank you.

--Jani
 
PHP Copyright © 2001-2026 The PHP Group
All rights reserved.
Last updated: Sun Oct 11 16:00:02 2026 UTC