php.net |  support |  documentation |  report a bug |  advanced search |  search howto |  statistics |  random bug |  login
Bug #6449 Compile Failure on a non-requested gd
Submitted: 2000-08-30 18:30 UTC Modified: 2000-08-30 18:41 UTC
From: ron at opus1 dot com Assigned:
Status: Closed Package: Compile Failure
PHP Version: 4.0.2 OS: RH linux 6.2
Private report: No CVE-ID: None
View Developer Edit
Welcome! If you don't have a Git account, you can't do anything here.
If you reported this bug, you can edit this bug over here.
(description)
Block user comment
Status: Assign to:
Package:
Bug Type:
Summary:
From: ron at opus1 dot com
New email:
PHP Version: OS:

 

 [2000-08-30 18:30 UTC] ron at opus1 dot com
./configure --with-apache=../apache_1.3.12 --with-pgsql=/usr/local/pgsql --with-ldap --with-imap --enable-ftp --with-mcal=/usr/local/mcal --with-oci8=/home/oracle/m01/app/oracle/product/8.1.6/ --enable-sysvshm=yes --enable-sysvsem=yes --with-config-file-path=/usr/local/apache/conf --enable-debug=no --enable-track-vars=yes --enable-magic-quotes=yes --enable-bcmath=yes --enable-force-cgi-redirect=yes --enable-discard-path=yes --enable-memory-limit=yes --enable-sigchild

Note: No GD here. :-)

But when attempting to 'make'.....

.....
make[2]: Leaving directory `/usr/local/src/php-4.0.2/ext/ftp'
Making all in gd
make[2]: Entering directory `/usr/local/src/php-4.0.2/ext/gd'
make[3]: Entering directory `/usr/local/src/php-4.0.2/ext/gd'
gcc  -I. -I/usr/local/src/php-4.0.2/ext/gd -I/usr/local/src/php-4.0.2 -I/usr/local/src/php-4.0.2/main -I/usr/local/src/apache_1.3.12/src/include -I/usr/local/src/apache_1.3.12/src/os/unix -I/usr/local/src/php-4.0.2/Zend -I/usr/local/src/php-4.0.2 -I/usr/local/include/freetype -I/usr/include/imap -I/usr/local/mcal/include -I/usr/local/src/php-4.0.2/ext/mysql/libmysql -I/home/oracle/m01/app/oracle/product/8.1.6//rdbms/public -I/home/oracle/m01/app/oracle/product/8.1.6//rdbms/demo -I/home/oracle/m01/app/oracle/product/8.1.6//network/public -I/usr/local/src/php-4.0.2/ext/xml/expat/xmltok -I/usr/local/src/php-4.0.2/ext/xml/expat/xmlparse  -DXML_BYTE_ORDER=12 -g -O2  -c gd.c && touch gd.lo
gd.c: In function `php_if_imagecreatefromgif':
gd.c:500: `gdImageCreateFromGif' undeclared (first use in this function)
gd.c:500: (Each undeclared identifier is reported only once
gd.c:500: for each function it appears in.)
gd.c: In function `php_if_imagegif':
gd.c:657: `gdImageGif' undeclared (first use in this function)
make[3]: *** [gd.lo] Error 1
make[3]: Leaving directory `/usr/local/src/php-4.0.2/ext/gd'
make[2]: *** [all-recursive] Error 1
make[2]: Leaving directory `/usr/local/src/php-4.0.2/ext/gd'
make[1]: *** [all-recursive] Error 1
make[1]: Leaving directory `/usr/local/src/php-4.0.2/ext'
make: *** [all-recursive] Error 1

It still tries to build gd.

Patches

Pull Requests

History

AllCommentsChangesGit/SVN commitsRelated reports
 [2000-08-30 18:41 UTC] rasmus@php.net
--without-gd (or fix your GD install and rm config.cache and try again)
 
PHP Copyright © 2001-2026 The PHP Group
All rights reserved.
Last updated: Sat Oct 10 23:00:01 2026 UTC