|
php.net | support | documentation | report a bug | advanced search | search howto | statistics | random bug | login |
PatchesPull RequestsHistoryAllCommentsChangesGit/SVN commits
[1999-07-20 06:50 UTC] simon at airdmhor dot gen dot nz
[1999-07-21 04:55 UTC] sas at cvs dot php dot net
|
|||||||||||||||||||||||||||
Copyright © 2001-2026 The PHP GroupAll rights reserved. |
Last updated: Sun Oct 11 22:00:01 2026 UTC |
Everything seems to configure fine (from my existing script), and PHP builds with no errors until sybase-ct.c, which shows: make[2]: Entering directory `/usr/src/php-4.0b1/ext/sybase' gcc -DHAVE_CONFIG_H -I. -I. -I../.. -I../../libzend -I../../TSRM -I/usr/src/apache_1.3.6/src/include -I/usr/src/apache_1.3.6/src/o s/unix -I/opt/sybase/include -I../.. -I../../libzend -g -O2 -g -c sybase-ct.c In file included from ../../libzend/zend.h:45, from ../../php.h:36, from sybase-ct.c:26: ../../libzend/zend_config.h:281: warning: `PACKAGE' redefined ../../php_config.h:518: warning: this is the location of the previous definition ../../libzend/zend_config.h:284: warning: `VERSION' redefined ../../php_config.h:521: warning: this is the location of the previous definition sybase-ct.c:1318: macro `zend_hash_update' used with only 5 args make[2]: *** [sybase-ct.o] Error 1 make[2]: Leaving directory `/usr/src/php-4.0b1/ext/sybase' make[1]: *** [all-recursive] Error 1 make[1]: Leaving directory `/usr/src/php-4.0b1/ext' make: *** [all-recursive] Error 1 The sybase is from the package available from their site : 11.0.3.3-2. If I build without sybase, everything seems okay.