php.net |  support |  documentation |  report a bug |  advanced search |  search howto |  statistics |  random bug |  login
Bug #14936 Apache compilarion failure in the php module
Submitted: 2002-01-08 15:31 UTC Modified: 2002-05-23 00:00 UTC
Votes:1
Avg. Score:3.0 ± 0.0
Reproduced:1 of 1 (100.0%)
Same Version:0 (0.0%)
Same OS:0 (0.0%)
From: pniklas at sinectis dot com dot ar Assigned:
Status: No Feedback Package: Compile Failure
PHP Version: 4.1.1 OS: Caldera eServer 2.3.1
Private report: No CVE-ID: None
Have you experienced this issue?
Rate the importance of this bug to you:

 [2002-01-08 15:31 UTC] pniklas at sinectis dot com dot ar
I have apache 1.3.14 and php 4.1.1

The PHP configure was:

./configure --with-apache=../apache_1.3.14 --without-mysql
--with-oci8=/u01/app/oracle/product/8.1.6 --enable-sysvshm=yes
--enable-sysvsem=yes --with-config-file-path=/etc --enable-debug=no
--with-exec-dir=/usr/local/bin --enable-track-vars=yes --with-x
--with-versioning --with-ftp --with-gd --with-gettext --with-gdbm
--enable-sigchild

And the apache configure

./configure -v --prefix=/etc/httpd --disable-rule=WANTHSREGEX
--sysconfdir=/etc/httpd/conf --datadir=/home/httpd --bindir=/usr/bin
--sbindir=/usr/sbin --libexecdir=/usr/libexec/apache
--includedir=/usr/include/apache --logfiledir=/var/log/httpd
--localstatedir=/var --runtimedir=/var/run --proxycachedir=/var/cache/httpd
--mandir=/usr/man --with-perl=/usr/bin --enable-module=most
--enable-shared=max --enable-module=expires --enable-module=headers
--enable-module=info --enable-module=so --enable-module=usertrack

I compiled succesfully PHP.. but

during apache compilation....

modules/php4/libphp4.a(string.o): In function `zif_strpos':
/usr/src/OpenLinux/SOURCES/php-4.1.1/ext/standard/string.c:1416: undefined
reference to `zgnd_get_parameters_ex'
make[2]: *** [target_static] Error 1
make[2]: Leaving directory `/usr/src/OpenLinux/SOURCES/apache_1.3.14/src'
make[1]: *** [build-std] Error 2
make[1]: Leaving directory `/usr/src/OpenLinux/SOURCES/apache_1.3.14'
make: *** [build] Error 2

Patches

Add a Patch

Pull Requests

Add a Pull Request

History

AllCommentsChangesGit/SVN commitsRelated reports
 [2002-04-22 23:43 UTC] sniper@php.net
Does this happen with Apache 1.3.24 and PHP 4.2.0 ?

 [2002-05-23 00:00 UTC] php-bugs at lists dot php dot net
No feedback was provided for this bug for over a month, so it is
being suspended automatically. If you are able to provide the
information that was originally requested, please do so and change
the status of the bug back to "Open".
 
PHP Copyright © 2001-2019 The PHP Group
All rights reserved.
Last updated: Mon May 27 11:01:28 2019 UTC