php.net |  support |  documentation |  report a bug |  advanced search |  search howto |  statistics |  random bug |  login
Bug #6832 oci8 compilation failure
Submitted: 2000-09-21 11:22 UTC Modified: 2000-10-29 00:04 UTC
From: gim at forsyth-partners dot co dot uk Assigned:
Status: Closed Package: Compile Failure
PHP Version: 4.0.2 OS: Linux (kernel 2.4.0-test7) RH 6.
Private report: No CVE-ID: None
 [2000-09-21 11:22 UTC] gim at forsyth-partners dot co dot uk
Configuration --with-oci8 , etc, etc  without any problem;

make install produced:

/bin/sh /root/build/php-4.0.2/libtool --silent --mode=compile gcc  -I. -I/root/build/php-4.0.2/main -I/root/build/php-4.0.2 -I/root/build/php-4.0.2/main -I/usr/local/apache/include -I/root/build/php-4.0.2/Zend -I/root/build/php-4.0.2 -I/root/build/php-4.0.2/ext/mysql/libmysql -I/opt/oracle/product/8.1.6/rdbms/demo -I/root/build/php-4.0.2/ext/xml/expat/xmltok -I/root/build/php-4.0.2/ext/xml/expat/xmlparse  -DEAPI=1 -DXML_BYTE_ORDER=12 -g -O2  -c internal_functions.c
In file included from internal_functions.c:39:
/root/build/php-4.0.2/ext/oci8/php_oci8.h:45: oci.h: No such file or directory
make[2]: *** [internal_functions.lo] Error 1
make[2]: Leaving directory `/root/build/php-4.0.2/main'
make[1]: *** [install-recursive] Error 1
make[1]: Leaving directory `/root/build/php-4.0.2/main'
make: *** [install-recursive] Error 1

Patches

Pull Requests

History

AllCommentsChangesGit/SVN commitsRelated reports
 [2000-10-16 10:30 UTC] sniper@php.net
What was the full configure line you used?
Did you have ORACLE_HOME defined?

--Jani
 [2000-10-29 00:04 UTC] sniper@php.net
No feedback. Please update to php4.03pl1 and use the path to
oracle home in --with-oci8.
 
PHP Copyright © 2001-2026 The PHP Group
All rights reserved.
Last updated: Thu Oct 08 23:00:02 2026 UTC