php.net |  support |  documentation |  report a bug |  advanced search |  search howto |  statistics |  random bug |  login
Bug #5135 microtime.c
Submitted: 2000-06-20 00:40 UTC Modified: 2000-07-31 15:05 UTC
From: fastslack at lainucs dot com Assigned:
Status: Closed Package: Compile Failure
PHP Version: 4.0.0 Release OS: Linux 2.4.0-test1
Private report: No CVE-ID: None
 [2000-06-20 00:40 UTC] fastslack at lainucs dot com
Making all in standard
make[2]: Entering directory `/download/php-4.0.0/ext/standard'
make[3]: Entering directory `/download/php-4.0.0/ext/standard'
gcc -DHAVE_CONFIG_H -I. -I/download/php-4.0.0/ext/standard -I/download/php-4.0.
microtime.c: In function `php_if_getrusage':
microtime.c:97: storage size of `usg' isn't known
microtime.c:100: `RUSAGE_SELF' undeclared (first use in this function)
microtime.c:100: (Each undeclared identifier is reported only once
microtime.c:100: for each function it appears in.)
microtime.c:106: `RUSAGE_CHILDREN' undeclared (first use in this function)
microtime.c:110: warning: implicit declaration of function `getrusage'
microtime.c:97: warning: unused variable `usg'
make[3]: *** [microtime.lo] Error 1
make[3]: Leaving directory `/download/php-4.0.0/ext/standard'
make[2]: *** [all-recursive] Error 1
make[2]: Leaving directory `/download/php-4.0.0/ext/standard'
make[1]: *** [all-recursive] Error 1
make[1]: Leaving directory `/download/php-4.0.0/ext'
make: *** [all-recursive] Error 1
---------------------------------------------------
with Apache 1.3.12 and Linux 2.4.0-test1

Patches

Pull Requests

History

AllCommentsChangesGit/SVN commitsRelated reports
 [2000-07-31 15:05 UTC] sas@php.net
This is not a PHP issue. Please refer to the last entry on this page for possible reasons:

http://bugs.php.net/bugs-php3.php?id=4949
 
PHP Copyright © 2001-2026 The PHP Group
All rights reserved.
Last updated: Sat Oct 10 13:00:01 2026 UTC