php.net |  support |  documentation |  report a bug |  advanced search |  search howto |  statistics |  random bug |  login
Bug #3966 Compile fails with Stronghold 2.3/Apache 1.2.6
Submitted: 2000-03-29 16:58 UTC Modified: 2000-07-30 12:41 UTC
From: nels at maei dot ca Assigned:
Status: Closed Package: Compile Failure
PHP Version: 4.0 Release Candidate 1 OS: Redhat Linux, kernel 2.2.14
Private report: No CVE-ID: None
 [2000-03-29 16:58 UTC] nels at maei dot ca
Output from make:
----
mod_php4.c: In function `php_apache_log_message':
mod_php4.c:282: `requset_rec' undeclared (first use this function)
mod_php4.c:282: (Each undeclared identifier is reported only once
mod_php4.c:282: for each function it appears in.)
mod_php4.c:282: parse error before `)'
make[3]: *** [mod_php4.lo] Error 1
make[3]: Leaving directory `/usr/local/www/src/php-4.0RC1/sapi/apache'
make[2]: *** [all-recursive] Error 1
make[2]: Leaving directory `/usr/local/www/src/php-4.0RC1/sapi/apache'
make[1]: *** [all-recursive] Error 1
make[1]: Leaving directory `/usr/local/www/src/php-4.0RC1/sapi'
make: *** [all-recursive] Error 1
----
Configured as:
----
./configure --with-config-file-path=/usr/local/www/conf --with-apache=/usr/local/www --with-gd --with-gdbm --with-db2 --with-mysql --with-xml --with-ldap --with-imap=/usr/src/redhat/BUILD/imap --with-pdflib --with-zlib --enable-sysvshm=yes --enable-sysvsem=yes --enable-track-vars=yes --enable-bcmath=yes --enable-memory-limit=yes
----
Server information:
Stronghold/2.3 Apache/1.2.6 C2NetUS/2010
----
Environment variables set, as per info on CNet website
pertaining to PHP configuration with Stronghold:

CFLAGS=-DSTRONGHOLD -I/usr/local/www/ssl/include

Patches

Pull Requests

History

AllCommentsChangesGit/SVN commitsRelated reports
 [2000-07-30 12:41 UTC] zak@php.net
Please try a recent release of PHP.  If the problem re-occurs, please submit a new bug report.  Thank you.
 
PHP Copyright © 2001-2026 The PHP Group
All rights reserved.
Last updated: Sun Oct 11 08:00:01 2026 UTC