php.net |  support |  documentation |  report a bug |  advanced search |  search howto |  statistics |  random bug |  login
Bug #3211 make failure
Submitted: 2000-01-14 05:08 UTC Modified: 2000-02-06 06:36 UTC
From: york1975 at 163 dot net Assigned:
Status: Closed Package: Compile Failure
PHP Version: 4.0 Beta 3 OS: Redhat 6.0
Private report: No CVE-ID: None
 [2000-01-14 05:08 UTC] york1975 at 163 dot net
# ./configure \
          --with-apache=../apache_1.3.x \
          --with-mysql=/path/to/mysql \
          --enable-memory-limit=yes \
          --enable-track-vars 
# make

zend_alloc.c:148: macro `_CHECK_MEMORY_LIMIT' used with just one arg
zend_alloc.c:237: macro `_CHECK_MEMORY_LIMIT' used with just one arg
gmake[2]: *** [zend_alloc.lo] Error 1
gmake[2]: Leaving directory `/var/src/ssl/php-4.0b3/libzend'
gmake[1]: *** [all-recursive] Error 1
gmake[1]: Leaving directory `/var/src/ssl/php-4.0b3'
gmake: *** [all-recursive-am] Error 2

It seems like the configure "--enable-memory-limit=yes" cause the failure.

B.Regards,
 York.
  2000-01-14 PM.

Patches

Pull Requests

History

AllCommentsChangesGit/SVN commitsRelated reports
 [2000-02-06 06:36 UTC] sas at cvs dot php dot net
Use a newer version, i.e. from http://snaps.php.net
 
PHP Copyright © 2001-2026 The PHP Group
All rights reserved.
Last updated: Sun Oct 11 21:00:02 2026 UTC