|
php.net | support | documentation | report a bug | advanced search | search howto | statistics | random bug | login |
[2000-03-30 07:37 UTC] aleino at cs dot joensuu dot fi
Was configured with: ./configure --with-mysql --with-apache=../apache --enable-track-vars --disable-debug Make wasn't a success; info on screen: make[3]: Entering directory `/usr/local/src/php-4.0RC1/ext/standard' gcc -DHAVE_CONFIG_H -I. -I/usr/local/src/php-4.0RC1/ext/standard -I../.. -I../../Zend -I/usr/local/src/php-4.0RC1 -I/ usr/local/src/apache/src/include -I/usr/local/src/apache/src/os/unix -I/usr/local/src/php-4.0RC1/ext/mysql/libmysql - I/usr/local/src/php-4.0RC1/ext/xml/expat/xmltok -I/usr/local/src/php-4.0RC1/ext/xml/expat/xmlparse -DXML_BYTE_ORDER= 12 -D_REENTRANT -g -O2 -c microtime.c && touch microtime.lo microtime.c: In function `php_if_getrusage': microtime.c:97: storage size of `usg' isn't known microtime.c:100: `RUSAGE_SELF' undeclared (first use in this function) microtime.c:100: (Each undeclared identifier is reported only once microtime.c:100: for each function it appears in.) microtime.c:106: `RUSAGE_CHILDREN' undeclared (first use in this function) make[3]: *** [microtime.lo] Error 1 make[3]: Leaving directory `/usr/local/src/php-4.0RC1/ext/standard' make[2]: *** [all-recursive] Error 1 make[2]: Leaving directory `/usr/local/src/php-4.0RC1/ext/standard' make[1]: *** [all] Error 1 make[1]: Leaving directory `/usr/local/src/php-4.0RC1/ext' make: *** [all-recursive] Error 1 PatchesPull RequestsHistoryAllCommentsChangesGit/SVN commits
|
|||||||||||||||||||||||||||
Copyright © 2001-2026 The PHP GroupAll rights reserved. |
Last updated: Wed Oct 07 23:00:01 2026 UTC |
It apeared again for me in php-4.2.2 on Slackware8.0 The problem is here (configure): configure:6921: checking for sys/resource. configure:6931: gcc -E conftest.c >/dev/null 2>conftest.out In file included from /usr/include/sys/resource.h:25, from configure:6927: /usr/include/bits/resource.h:109: warning: `RLIM_INFINITY' redefined /usr/include/asm/resource.h:26: warning: this is the location of the previous de configure: failed program was: #line 6926 "configure" #include "confdefs.h" #include <sys/resource.h> i.e. the configure script confused the warning with failure. Will anybody reopen it? (I don't have account here)