|
php.net | support | documentation | report a bug | advanced search | search howto | statistics | random bug | login |
[2002-06-19 08:21 UTC] matt8192 at yahoo dot com
When compiling for Apache httpd 2.0.39, php "make" gives this error: ./configure --with-apxs2=/www/bin/apxs --with-mysql [...] make [...] /bin/sh /home/matt/php-4.2.1/libtool --silent --mode=compile gcc -I. -I/home/matt/php-4.2.1/sapi/apache2filter -I/home/matt/php-4.2.1/main -I/home/matt/php-4.2.1 -I/www/include -I/home/matt/php-4.2.1/Zend -I/home/matt/php-4.2.1/ext/mysql/libmysql -I/home/matt/php-4.2.1/ext/xml/expat -D_REENTRANT -I/home/matt/php-4.2.1/TSRM -DTHREAD=1 -g -O2 -pthread -DZTS -prefer-pic -c php_functions.c php_functions.c:93:27: missing binary operator before '!' make[3]: *** [php_functions.lo] Error 1 make[3]: Leaving directory `/home/matt/php-4.2.1/sapi/apache2filter' make[2]: *** [all-recursive] Error 1 make[2]: Leaving directory `/home/matt/php-4.2.1/sapi/apache2filter' make[1]: *** [all-recursive] Error 1 make[1]: Leaving directory `/home/matt/php-4.2.1/sapi' make: *** [all-recursive] Error 1 PatchesPull RequestsHistoryAllCommentsChangesGit/SVN commits
|
|||||||||||||||||||||||||||
Copyright © 2001-2026 The PHP GroupAll rights reserved. |
Last updated: Wed Oct 07 13:00:02 2026 UTC |
Bug summary semantic update ("Compile *for* apache fails" not "apache compile fails")